{"text_format":"1","workbook":"xlsx","n_sheets":18,"sheets":["CHECK","DATABASE","CG","เห็นชอบรวม(น1)","ใบเสนอราคา","รายงานจัดจ้าง","แนบท้ายรายงาน2","คำสั่ง","การพิจารณา","ประกาศ","ใบสั่งจ้าง","ขอบเขตงาน(น2)","รายงานข้อ 16","ใบส่งของ มอบ","ใบตรวจรับ","ใบสำคัญรับเงิน","บริสุทธิ์","เบิกจ่ายเงินรวม"],"not_rendered":{"charts":0,"images":5,"macros":1,"external_links":1,"defined_names":29,"comments":3,"pivot_tables":0},"unopened":[],"bounds":{"document_bytes":16777216,"sheet_cells":100000,"rows_first":2000,"rows_last":500,"rows_between":2000,"halvings":0,"cell_chars":16384,"cell_head_chars":4096},"cells_cut":0,"cells_raw":0,"read":"whole","date_system":"1900"}

{"sheet":"CHECK","index":0,"n_rows":15,"n_cols":11,"rows_kept":15,"cut":false,"hidden":false,"merged":[[0,1,0,10],[1,1,2,1],[1,2,2,2],[1,3,2,3],[1,4,2,4],[1,5,2,5],[1,6,2,6],[1,7,2,7],[1,8,2,8],[1,9,1,10]]}
[null,"ใบตรวจสอบการดำเนิน (การจัดจ้าง)"]
[null,"ที่","รายการ","จาก","ถึง","ว ด ป",null,"CHECK","Detials ERROR (ต้องทำการแก้ไข ดังนี้)","วิธีการ ต้องดำเนินาร"]
[null,null,null,null,null,null,null,null,null,"ก่อน/เท่ากับ วดป.","หลัง/เท่ากับ วดป."]
[null,1,"ขอความเห็นชอบ","รพ.สต.","สสอ.",{"$f":"'เห็นชอบรวม(น1)'!H4","v":"2562-08-21"},{"$f":"IF(F4<=F6,1,0)","v":1},{"$f":"IF(G4=1,\"OK\",\"ต้องแก้ไข\")","v":"OK"},{"$f":"IF(G4=0,\"ต้องดำเนินการ ก่อน หรือ = รายงานการซื้อ / จ้าง\",\"\")","v":""},{"$f":"IF(G4=0,F6,\"\")","v":""}]
[null,3,"ใบเสนอราคา","ผู้ค้า/ผู้รับจ้าง","รพ.สต./สสอ.",{"$f":"ใบเสนอราคา!D5","v":"2562-08-22"},{"$f":"IF(F5>=F4,1,0)","v":1},{"$f":"IF(G5=1,\"OK\",\"ต้องแก้ไข\")","v":"OK"},{"$f":"IF(G5=0,\"ต้องดำเนินการ หลัง หรือ = ขอความเห็นชอบ\",\"\")","v":""},null,{"$f":"IF(G5=0,F4,\"\")","v":""}]
[null,2,"รายงานการซื้อ/จ้าง","สสอ.","ผวจ.",{"$f":"รายงานจัดจ้าง!H3","v":"2562-08-22"},{"$f":"IF(F6>=F4,1,0)","v":1},{"$f":"IF(G6=1,\"OK\",\"ต้องแก้ไข\")","v":"OK"},{"$f":"IF(G6=0,\"ต้องดำเนินการ หลัง หรือ = ขอความเห็นชอบ\",\"\")","v":""},null,{"$f":"IF(G6=0,F4,\"\")","v":""}]
[null,3,"คำสั่งจังหวัดบุรีรัมย์",null,null,{"$f":"คำสั่ง!E19","v":"00:00:00"},{"$f":"IF(F7>=F6,1,0)","v":0},{"$f":"IF(G7=1,\"OK\",\"ต้องแก้ไข\")","v":"ต้องแก้ไข"},{"$f":"IF(G7=0,\"ต้องดำเนินการ หลัง หรือ = รายงานการซื้อ/จ้าง\",\"\")","v":"ต้องดำเนินการ หลัง หรือ = รายงานการซื้อ/จ้าง"},null,{"$f":"IF(G7=0,F6,\"\")","v":"2562-08-22"}]
[null,4,"รายงานผลการพิจารณา","สสอ.","ผวจ.",{"$f":"การพิจารณา!H3","v":"2560-09-28"},{"$f":"IF(F8>=F6,1,0)","v":0},"ต้องแก้ไข",{"$f":"IF(G8=0,\"ต้องดำเนินการ หลัง หรือ = รายงานการซื้อ/จ้าง\",\"\")","v":"ต้องดำเนินการ หลัง หรือ = รายงานการซื้อ/จ้าง"},null,{"$f":"IF(G8=0,F6,\"\")","v":"2562-08-22"}]
{"$rows_left_out":8}
{"sheet":"DATABASE","index":1,"n_rows":26,"n_cols":5,"rows_kept":26,"cut":false,"hidden":false,"merged":[[0,1,0,3]]}
[null,"ข้อมูลทั่วไป (การจัดจ้าง)"]
[null,"หน่วยงานบังคับบัญชา","สำนักงานสาธารณสุขอำเภอหนองหงส์ ถ.ราษฎร์บำรุง จังหวัดบุรีรัมย์","โทร. 0 4466 9276"]
[null,"ที่หนังสือ สสอ.","บร 1332.1/"]
[null,"หน่วยงานบริหาร","สำนักงานสาธารณสุขอำเภอหนองหงส์","อำเภอหนองหงส์  จังหวัดบุรีรัมย์ "]
[null,"ที่อยู่","ที่อยู่ หมู่ที่ 14 ถนนราษฎร์บำรุง ตำบลสระแก้ว 31240","โทร. 0 4466 9276, 0 4466 9020"]
[null,"หัวหน้าหน่วยงาน","นายประหยัด  นงประโคน","สาธารณสุขอำเภอหนองหงส์"]
[null,"หัวหน้าเจ้าหน้าที่","นางจุรีพร  บัวลอย","นักวิชาการสาธารณสุข ชำนาญการ"]
[null,"เลขคำสั่ง สป. การอนุมัติจ่ายเงิน","ปฏิบัติตามคำสั่ง สป. ที่ 2999/2559 ลว. 30 กันยายน 2559"]
{"$rows_left_out":19}
{"sheet":"CG","index":2,"n_rows":40,"n_cols":23,"rows_kept":40,"cut":false,"hidden":true,"merged":[[2,1,6,1]]}
[]
[null,"ประจำเดือน","2560-12-01",{"$f":"MONTH(C2)","v":12},{"$f":"YEAR(C2)","v":2560},{"$f":"D2","v":12},null,null,"กลุ่มที่",null,"ประเภทผู้สูงอายุที่มีภาวะพึ่งพิง"]
[null,"ผู้ช่วยเหลือดูแลผู้สูงอายุที่มีภาวะพึ่งพิง (Care Giver)",300,"บาท",9,"คน",{"$f":"C3*E3","v":2700},"บาท",1,null,"เคลื่อนไหวได้บ้างและอาจมีปัญหาการกิน หรือขับถ่ายแต่ไม่มีภาวะสับสนทางสมอง"]
[null,null,600,"บาท",2,"คน",{"$f":"C4*E4","v":1200},"บาท",2,null,"เหมือนกลุ่มที่ 1 แต่มีภาวะสับสนทางสมอง"]
[null,null,null,"บาท",null,"คน",{"$f":"C5*E5","v":0},"บาท",3,null,"เคลื่อนไหวเองไม่ได้และอาจมีปัญหาการกิน หรือขับถ่ายหรือมีอาการเจ็บป่วยรุนแรง"]
[null,null,null,"บาท",null,"คน",{"$f":"C6*E6","v":0},"บาท",4,null,"เหมือนกลุ่มที่ 3 และมีอาการ เจ็บป่วยรุนแรง หรืออยู่ในระยะท้ายของชีวิต"]
[null,null,null,"บาท",null,"คน",{"$f":"C7*E7","v":0},"บาท",null,null,null,null,null,null,null,null,null,"จ้างตั้งแต่เดือน","ธันวาคม",2560,"ถึง","กันยายน",2561]
[null,null,null,"รวม",{"$f":"SUM(E3:E7)","v":11},"รวมเงิน",{"$f":"SUM(G3:G7)","v":3900},"บาท",null,null,null,null,null,null,null,null,null,null,"รวมจ้าง (ด.)"]
{"$rows_left_out":33}
{"sheet":"เห็นชอบรวม(น1)","index":3,"n_rows":99,"n_cols":16,"rows_kept":99,"cut":false,"hidden":false,"merged":[[1,1,1,8],[85,5,85,6],[93,7,93,9],[97,7,97,8],[98,7,98,8],[7,1,7,9]]}
[]
[null,"บันทึกข้อความ"]
[null,"ส่วนราชการ",null,null,{"$f":"DATABASE!C15&\" \"&DATABASE!D15","v":"โรงพยาบาลส่งเสริมสุขภาพตำบลบ้านกระเบื้องน้อย อำเภอหนองหงส์ จังหวัดบุรีรัมย์"}]
[null,"ที่",{"$f":"DATABASE!C13","v":"บร 1332.1.4/"},null,166,null,"วันที่","2562-08-21"]
[null,"เรื่อง","ถ่ายเอกสารงานราชการและเข้าเล่ม"]
[null,"เรียน",{"$f":"DATABASE!D6","v":"สาธารณสุขอำเภอหนองหงส์"}]
[null,null,null,null,"ความเป็นมา"]
[null,"                                ด้วย สำนักโรคไม่ติดต่อ กรมควบคุมโรค ได้เชิญส่งผลงานการดำเนินงานทีมป้องกันการบาดเจ็บทางถนนระดับตำบล (RTI team) และทีมป้องกันเด็กจมน้ำ ประจำปี 2562 โดย สสจ.บุรีรัมย์ได้เชิญนำเสนอผลงานการดำเนินงาน โดยเตรียมเอกสารรูปเล่มพร้อมไฟล์นำเสนอ ในวันที่ 23 สิงหาคม 2562นั้น และส่งรูปเล่มทั้ง 2 กิจกรรมภายในวันที่ 30 กันยายน 2562 นั้น ในการนี้ โรงพยาบาลส่งเสริมสุขภาพตำบลบ้านกระเบื้องน้อย ต.หนองชัยศรี ได้ส่งผลงานนำเสนอการป้องกันบาดเจ็บทางถนน ระดับ Excellent เป็นปีที่ 2 และทีมป้องกันเด็กจมน้ำ ระดับทอง ดังนั้น เพื่อให้การดำเนินงานเป็นไปด้วยความเรียบร้อย มีประสิทธิภาพ จึงใคร่ขอจัดจ้างถ่ายเอกสารเพื่อใช้ในงานราชการต่อไป"]
{"$rows_left_out":92}
{"sheet":"ใบเสนอราคา","index":4,"n_rows":24,"n_cols":9,"rows_kept":24,"cut":false,"hidden":false,"merged":[[18,1,18,5],[21,3,21,5],[22,3,22,5],[23,3,23,5],[8,1,8,6],[10,3,10,4],[0,1,0,6],[1,1,1,6],[2,1,2,6],[3,1,3,6],[4,3,4,5]]}
[null,"ใบเสนอราคา"]
[null,{"$f":"DATABASE!C19","v":"หจก. เอกสารซีพี"}]
[null,{"$f":"DATABASE!C20","v":"95/10-11 ถ.อินจันทร์รรงค์  ต.ในเมือง อ.เมือง จ.บุรีรัมย์"}]
[null,{"$f":"DATABASE!D20","v":"โทรศัพท์ 0 4461 4005"}]
[null,null,"วันที่","2562-08-22",null,null,null,"รายละเอียดให้ไปบันทึกใน Sheet แนบท้ายรายงาน"]
[null,"เรื่อง  ","เสนอราคาจ่างถ่ายเอกสารพร้อมเข้าเล่ม"]
[null,"เรียน  ",{"$f":"DATABASE!B11","v":"เจ้าหน้าที่"}]
[null,null,{"$f":"DATABASE!C19&\" \"&DATABASE!C20&\" \"&DATABASE!D20","v":"หจก. เอกสารซีพี 95/10-11 ถ.อินจันทร์รรงค์  ต.ในเมือง อ.เมือง จ.บุรีรัมย์ โทรศัพท์ 0 4461 4005"}]
{"$rows_left_out":17}
{"sheet":"รายงานจัดจ้าง","index":5,"n_rows":40,"n_cols":14,"rows_kept":40,"cut":false,"hidden":false,"merged":[[18,2,18,3],[0,1,0,11],[13,5,13,11],[1,3,1,11],[4,2,4,9],[12,1,12,11],[2,2,2,3],[2,7,2,11],[10,1,10,11],[23,1,23,11],[38,7,38,11],[37,3,37,5],[38,1,38,6],[33,3,33,5],[33,7,33,10],[37,7,37,11],[30,3,30,11],[26,4,26,5],[27,4,27,5],[28,4,28,5]]}
[1,"บันทึกข้อความ"]
["ใส่เลขลำดับ CG","ส่วนราชการ",null,{"$f":"DATABASE!C4&\" \"&DATABASE!D4","v":"สำนักงานสาธารณสุขอำเภอหนองหงส์ อำเภอหนองหงส์  จังหวัดบุรีรัมย์ "}]
[null,"ที่",{"$f":"DATABASE!C3","v":"บร 1332.1/"},null,1016,null,"วันที่","2562-08-22"]
[null,"เรื่อง",{"$f":"'เห็นชอบรวม(น1)'!C5","v":"ถ่ายเอกสารงานราชการและเข้าเล่ม"}]
[null,"เรียน",{"$f":"\"ผู้ว่าราชการจังหวัดบุรีรัมย์ (โดย\"&DATABASE!D6&\"ปฏิบัติราชการแทน)\"","v":"ผู้ว่าราชการจังหวัดบุรีรัมย์ (โดยสาธารณสุขอำเภอหนองหงส์ปฏิบัติราชการแทน)"}]
[null,null,null,"ด้วย",{"$f":"DATABASE!C15","v":"โรงพยาบาลส่งเสริมสุขภาพตำบลบ้านกระเบื้องน้อย"},null,null,"จะดำเนินการขอจ้างบริการ จำนวน",null,null,{"$f":"แนบท้ายรายงาน2!E2","v":3},{"$f":"แนบท้ายรายงาน2!F2","v":"รายการ"}]
[null,{"$f":"\"โดยการจ้างบริการ\"&CG!B3&\" \"&#REF!","v":{"$error":"#REF!"}}]
[null,"โดยวิธีเฉพาะเจาะจง เพื่อใช้ในงานราชการ ตามหนังสือที่",null,null,null,null,{"$f":"'เห็นชอบรวม(น1)'!C4&'เห็นชอบรวม(น1)'!E4&\"    ลงวันที่ \"","v":"บร 1332.1.4/166    ลงวันที่ "},null,null,{"$f":"'เห็นชอบรวม(น1)'!H4","v":"2562-08-21"},"(เอกสารที่ 1)"]
{"$rows_left_out":33}
{"sheet":"แนบท้ายรายงาน2","index":6,"n_rows":24,"n_cols":14,"rows_kept":24,"cut":false,"hidden":false,"merged":[[3,1,4,1],[3,2,4,2],[3,3,3,4],[3,7,3,8],[4,3,4,4],[0,1,0,5],[0,7,0,8],[0,9,0,11],[1,1,1,3],[2,1,2,8]]}
[null,{"$f":"\"รายละเอียดแนบท้ายบันทึกข้อความ\"&รายงานจัดจ้าง!B3&\" \"&รายงานจัดจ้าง!C3&\" \"&รายงานจัดจ้าง!E3","v":"รายละเอียดแนบท้ายบันทึกข้อความที่ บร 1332.1/ 1016"},null,null,null,null,"ลงวันที่",{"$f":"รายงานจัดจ้าง!H3","v":"2562-08-22"},null,"รวม VAT ใส่เลข 1 ไม่รวมใส่เลข 0"]
[null,"งานจัดจ้าง จำนวน",null,null,{"$f":"COUNT(B6:B21)","v":3},"รายการ",null,null,null,0,"<<< บันทึกเลข 1 หรือ 0"]
[null,"โรงพยาบาลส่งเสริมสุขภาพตำบลบ้านกระเบื้องน้อย"]
[null,"ลำดับที่","รายละเอียดของพัสดุที่จะจ้าง","ความต้องการ",null,"o","ราคามาตรฐาน","จำนวนและวงเงินที่ขอจ้างครั้งนี้",null,null,null,"< ถ้าตั้งเงินไว้",null,"o"]
[null,null,null,"จำนวน\n",null,"þ","ราคาที่ได้จากการสืบจากท้องตลาด\n     หน่วยละ","หน่วยละ\n(บาท)","จำนวนเงิน\n(บาท)",null,"<< เลือกตัวกรองก่อนปริ้นทุกครั้ง",null,null,"þ"]
[null,1,"ค่าถ่ายเอกสารสี และขาวดำ จำนวน 98 หน้า พร้อมเข้าเล่ม(ส่งเขต)",1,"เล่ม",null,null,700,{"$f":"D6*H6","v":700},{"$f":"IF(C6=\"\",\"\",\"เลือกปริ้น\")","v":"เลือกปริ้น"}]
[null,2,"ค่าถ่ายเอกสารสี และขาวดำ จำนวน 141 หน้า พร้อมเข้าเล่ม (ส่งเขต)",1,"เล่ม",null,null,1018,{"$f":"D7*H7","v":1018},{"$f":"IF(C7=\"\",\"\",\"เลือกปริ้น\")","v":"เลือกปริ้น"}]
[null,3,"ค่าถ่ายเอกสารขาวดำ จำนวน 98 หน้า พร้อมเข้าเล่ม(นำเสนอ สสจ.)",2,"เล่ม",null,null,141,{"$f":"D8*H8","v":282},"เลือกปริ้น"]
{"$rows_left_out":17}
{"sheet":"คำสั่ง","index":7,"n_rows":26,"n_cols":11,"rows_kept":26,"cut":false,"hidden":true,"merged":[[6,1,6,9],[5,1,5,9],[4,1,4,9],[24,4,24,8],[25,3,25,9],[22,5,22,7],[23,5,23,7],[18,4,18,6],[8,1,8,9]]}
[]
[]
[]
[]
[null,"คำสั่งจังหวัดบุรีรัมย์",null,null,null,null,null,null,null,null,"พิมพ์กรณีเกิน 5,000 บาท"]
[null,{"$f":"DATABASE!C9","v":"ที่              /2560"}]
[null,{"$f":"'เห็นชอบรวม(น1)'!C5","v":"ถ่ายเอกสารงานราชการและเข้าเล่ม"}]
[null,null,{"$f":"'เห็นชอบรวม(น1)'!C5","v":"ถ่ายเอกสารงานราชการและเข้าเล่ม"}]
{"$rows_left_out":19}
{"sheet":"การพิจารณา","index":8,"n_rows":98,"n_cols":13,"rows_kept":98,"cut":false,"hidden":true,"merged":[[31,1,31,5],[32,1,32,5],[9,1,9,5],[10,1,10,5],[29,7,29,8],[24,7,24,8],[25,7,25,8],[26,7,26,8],[27,7,27,8],[28,7,28,8],[30,7,30,8],[31,7,31,8],[32,7,32,8],[29,1,29,5],[0,1,0,10],[89,6,89,8],[2,2,2,3],[4,2,4,9],[2,7,2,9],[7,9,7,10],[7,7,7,8],[7,1,7,5],[8,1,8,5],[30,9,30,10],[31,9,31,10],[32,9,32,10],[33,9,33,10],[34,9,34,10],[8,7,8,8],[9,7,9,8],[10,7,10,8],[25,1,25,5],[26,1,26,5],[8,9,8,10],[9,9,9,10],[10,9,10,10],[24,9,24,10],[25,9,25,10],[26,9,26,10],[27,9,27,10],[28,9,28,10],[29,9,29,10],[30,1,30,5],[44,1,44,5],[45,1,45,5],[46,1,46,5],[47,1,47,5],[39,7,39,8],[40,7,40,8],[41,7,41,8],[42,7,42,8],[43,7,43,8],[34,7,34,8],[35,7,35,8],[36,7,36,8],[37,7,37,8],[38,7,38,8],[33,1,33,5],[40,1,40,5],[41,1,41,5],[42,1,42,5],[43,1,43,5],[33,7,33,8],[48,1,48,5],[11,1,11,5],[12,1,12,5],[13,1,13,5],[14,1,14,5],[15,1,15,5],[16,1,16,5],[17,1,17,5],[18,1,18,5],[19,1,19,5],[20,1,20,5],[21,1,21,5],[22,1,22,5],[23,1,23,5],[24,1,24,5],[35,1,35,5],[36,1,36,5],[37,1,37,5],[38,1,38,5],[39,1,39,5],[34,1,34,5],[27,1,27,5],[28,1,28,5],[54,1,54,5],[55,1,55,5],[56,1,56,5],[57,1,57,5],[58,1,58,5],[49,1,49,5],[50,1,50,5],[51,1,51,5],[52,1,52,5],[53,1,53,5],[72,1,72,5],[73,1,73,5],[64,1,64,5],[65,1,65,5],[66,1,66,5],[67,1,67,5],[68,1,68,5],[59,1,59,5],[60,1,60,5],[61,1,61,5],[62,1,62,5],[63,1,63,5],[79,1,79,5],[80,1,80,5],[81,1,81,5],[11,7,11,8],[12,7,12,8],[13,7,13,8],[14,7,14,8],[15,7,15,8],[16,7,16,8],[17,7,17,8],[18,7,18,8],[19,7,19,8],[20,7,20,8],[21,7,21,8],[22,7,22,8],[23,7,23,8],[74,1,74,5],[75,1,75,5],[76,1,76,5],[77,1,77,5],[78,1,78,5],[69,1,69,5],[70,1,70,5],[71,1,71,5],[49,7,49,8],[50,7,50,8],[51,7,51,8],[52,7,52,8],[53,7,53,8],[44,7,44,8],[45,7,45,8],[46,7,46,8],[47,7,47,8],[48,7,48,8],[59,7,59,8],[60,7,60,8],[61,7,61,8],[62,7,62,8],[63,7,63,8],[54,7,54,8],[55,7,55,8],[56,7,56,8],[57,7,57,8],[58,7,58,8],[77,7,77,8],[78,7,78,8],[69,7,69,8],[70,7,70,8],[71,7,71,8],[72,7,72,8],[73,7,73,8],[64,7,64,8],[65,7,65,8],[66,7,66,8],[67,7,67,8],[68,7,68,8],[35,9,35,10],[36,9,36,10],[37,9,37,10],[38,9,38,10],[39,9,39,10],[79,7,79,8],[80,7,80,8],[81,7,81,8],[11,9,11,10],[12,9,12,10],[13,9,13,10],[14,9,14,10],[15,9,15,10],[16,9,16,10],[17,9,17,10],[18,9,18,10],[19,9,19,10],[20,9,20,10],[21,9,21,10],[22,9,22,10],[23,9,23,10],[74,7,74,8],[75,7,75,8],[76,7,76,8],[45,9,45,10],[46,9,46,10],[47,9,47,10],[48,9,48,10],[49,9,49,10],[40,9,40,10],[41,9,41,10],[42,9,42,10],[43,9,43,10],[44,9,44,10],[55,9,55,10],[56,9,56,10],[57,9,57,10],[58,9,58,10],[59,9,59,10],[50,9,50,10],[51,9,51,10],[52,9,52,10],[53,9,53,10],[54,9,54,10],[65,9,65,10],[66,9,66,10],[67,9,67,10],[68,9,68,10],[69,9,69,10],[60,9,60,10],[61,9,61,10],[62,9,62,10],[63,9,63,10],[64,9,64,10],[75,9,75,10],[76,9,76,10],[77,9,77,10],[78,9,78,10],[79,9,79,10],[70,9,70,10],[71,9,71,10],[72,9,72,10],[73,9,73,10],[74,9,74,10],[96,6,96,10],[97,6,97,10],[90,5,90,10],[94,2,94,5],[95,2,95,5],[95,6,95,10],[80,9,80,10],[81,9,81,10],[82,7,82,8],[82,9,82,10],[82,1,82,6]]}
[null,"บันทึกข้อความ"]
[null,"ส่วนราชการ",null,{"$f":"DATABASE!C15&\" \"&DATABASE!D4","v":"โรงพยาบาลส่งเสริมสุขภาพตำบลบ้านกระเบื้องน้อย อำเภอหนองหงส์  จังหวัดบุรีรัมย์ "}]
[null,"ที่",{"$f":"DATABASE!C13","v":"บร 1332.1.4/"},null,null,null,"วันที่","2560-09-28"]
[null,"เรื่อง",{"$f":"รายงานจัดจ้าง!C4","v":"ถ่ายเอกสารงานราชการและเข้าเล่ม"},null,null,null,null,null,null,null,null,"พิมพ์กรณีเกิน 5,000 บาท"]
[null,"เรียน",{"$f":"รายงานจัดจ้าง!C5","v":"ผู้ว่าราชการจังหวัดบุรีรัมย์ (โดยสาธารณสุขอำเภอหนองหงส์ปฏิบัติราชการแทน)"}]
[null,null,null,{"$f":"'เห็นชอบรวม(น1)'!C5","v":"ถ่ายเอกสารงานราชการและเข้าเล่ม"}]
[null,"โดยวิธีเฉพาะเจาะจง ดังนี้"]
[null,"รายการพิจารณา",null,null,null,null,"ผู้ชนะการเสนอราคา","ราคาที่เสนอ",null,"ราคาที่ตกลงซื้อ",null,null,"<< เลือกตัวกรองก่อนปริ้นทุกครั้ง"]
{"$rows_left_out":91}
{"sheet":"ประกาศ","index":9,"n_rows":91,"n_cols":12,"rows_kept":91,"cut":false,"hidden":true,"merged":[[89,4,89,8],[90,3,90,9],[85,4,85,5],[4,1,4,9],[5,1,5,9],[87,5,87,7],[88,5,88,7]]}
[]
[]
[]
[]
[null,"ประกาศจังหวัดบุรีรัมย์",null,null,null,null,null,null,null,null,"พิมพ์กรณีเกิน 5,000 บาท"]
[null,{"$f":"'เห็นชอบรวม(น1)'!C5","v":"ถ่ายเอกสารงานราชการและเข้าเล่ม"}]
[null,null,{"$f":"DATABASE!C15","v":"โรงพยาบาลส่งเสริมสุขภาพตำบลบ้านกระเบื้องน้อย"}]
[null,{"$f":"'เห็นชอบรวม(น1)'!C5","v":"ถ่ายเอกสารงานราชการและเข้าเล่ม"},null,null,null,null,null,null,null,null,null,"<< เลือกตัวกรองก่อนปริ้นทุกครั้ง"]
{"$rows_left_out":84}
{"sheet":"ใบสั่งจ้าง","index":10,"n_rows":99,"n_cols":13,"rows_kept":99,"cut":false,"hidden":false,"merged":[[11,3,12,4],[94,4,94,6],[95,4,95,6],[96,5,96,6],[91,2,91,6],[92,2,92,6],[4,7,4,8],[93,4,93,6],[83,2,83,6],[84,3,84,5],[8,1,8,3],[8,4,8,6],[9,1,9,6],[11,1,12,1],[11,2,12,2],[5,4,5,6],[6,1,6,3],[6,4,6,6],[7,1,7,3],[7,4,7,6],[5,7,5,8],[90,2,90,6],[84,9,84,10],[85,2,85,6],[87,2,87,6],[89,2,89,6],[79,1,79,3],[79,4,79,5],[80,1,80,3],[80,4,80,5],[81,1,81,3],[81,4,81,5],[88,2,88,6],[0,1,1,6],[2,1,2,6],[3,1,3,3],[4,5,4,6],[3,5,3,6],[4,1,5,3]]}
[]
[]
[null,"ใบสั่งจ้าง",null,null,null,null,null,null,null,null,{"$f":"DAY(F5)","v":22},{"$f":"MONTH(F5)","v":8},{"$f":"YEAR(F5)","v":2562}]
[null,{"$f":"\"ผู้รับจ้าง :  \"&DATABASE!C19","v":"ผู้รับจ้าง :  หจก. เอกสารซีพี"},null,null,"ใบสั่งจ้าง เลขที่","710/2562"]
[null,{"$f":"\"ที่อยู่   \"&DATABASE!C20&\"         \n \"&DATABASE!D20","v":"ที่อยู่   95/10-11 ถ.อินจันทร์รรงค์  ต.ในเมือง อ.เมือง จ.บุรีรัมย์         \n โทรศัพท์ 0 4461 4005"},null,null,"วันที่ ","2562-08-22",null,"บันทึกรับใบสั่งซื้อ >>>>",null,{"$f":"F5+1","v":"2562-08-23"}]
[null,null,null,null,{"$f":"DATABASE!C4","v":"สำนักงานสาธารณสุขอำเภอหนองหงส์"},null,null,"วันทำการสุดท้าย >>>>",null,"2561-01-29"]
[null,{"$f":"\"เลขประจำตัวผู้เสียภาษี   \"&DATABASE!C21","v":"เลขประจำตัวผู้เสียภาษี   313555000044"},null,null,{"$f":"DATABASE!C5","v":"ที่อยู่ หมู่ที่ 14 ถนนราษฎร์บำรุง ตำบลสระแก้ว 31240"}]
[null,"-",null,null,{"$f":"DATABASE!D15","v":"อำเภอหนองหงส์ จังหวัดบุรีรัมย์"}]
{"$rows_left_out":92}
{"sheet":"ขอบเขตงาน(น2)","index":11,"n_rows":27,"n_cols":4,"rows_kept":27,"cut":false,"hidden":true,"merged":[[0,1,0,11]]}
[null,"ขอบเขตของงานที่ให้ Care giver ทำ"]
[null,"ผู้ช่วยเหลือดูแลผู้สูงอายุที่มีภาวะพึ่งพิง (Care giver)"]
[null,null,"หมายถึง บุคคลที่ผ่านการอบรมตามหลักสูตรที่คณะอนุกรรมการ LTC หรือคณะอนุกรรมการอื่นภายใต้ คณะกรรมการ"]
[null,"หลักประกันสุขภาพแห่งชาติ หรือ สปสช. เห็นชอบ"]
[null,null,"ขอบเขต/บทบาทหน้าที่ของ Care giver "]
[null,null,"ดูแลผู้สูงอายุตามแผนการดูแลที่ได้รับมอบหมาย ได้แก่ "]
[null,null,null,"1. ดูแลกิจวัตรประจำวันของผู้สูงอายุ เช่น การรับประทานอาหาร การนอนหลับพักผ่อน การเคลื่อนย้าย "]
[null,"การขับถ่าย ให้ถูกสุขลักษณะปลอดภัยเหมาะสมกับวัยของผู้สูงอายุ "]
{"$rows_left_out":20}
{"sheet":"รายงานข้อ 16","index":12,"n_rows":36,"n_cols":11,"rows_kept":36,"cut":false,"hidden":false,"merged":[[35,1,35,6],[12,1,12,11],[13,5,13,11],[24,1,24,11],[33,3,33,5],[33,7,33,11],[34,1,34,6],[34,7,34,11],[0,1,0,11],[1,3,1,11],[2,2,2,3],[2,7,2,9],[6,7,6,9],[10,1,10,11]]}
[null,"บันทึกข้อความ"]
[null,"ส่วนราชการ",null,{"$f":"DATABASE!C4&\" \"&DATABASE!D4","v":"สำนักงานสาธารณสุขอำเภอหนองหงส์ อำเภอหนองหงส์  จังหวัดบุรีรัมย์ "}]
[null,"ที่",{"$f":"DATABASE!C3","v":"บร 1332.1/"},null,325,null,"วันที่","2562-03-21"]
[null,"เรื่อง",{"$f":"รายงานจัดจ้าง!C4","v":"ถ่ายเอกสารงานราชการและเข้าเล่ม"}]
[null,"เรียน",{"$f":"รายงานจัดจ้าง!C5","v":"ผู้ว่าราชการจังหวัดบุรีรัมย์ (โดยสาธารณสุขอำเภอหนองหงส์ปฏิบัติราชการแทน)"}]
[null,null,null,"เรื่องเดิม"]
[null,null,null,{"$f":"\"ตามบันทึกรายงานขอซื้อ/ขอจ้าง \"&รายงานจัดจ้าง!B3&\" \"&รายงานจัดจ้าง!C3&\" \"&รายงานจัดจ้าง!E3&\" \"&\" ลงวันที่\"","v":"ตามบันทึกรายงานขอซื้อ/ขอจ้าง ที่ บร 1332.1/ 1016  ลงวันที่"},null,null,null,{"$f":"รายงานจัดจ้าง!H3","v":"2562-08-22"}]
[null,{"$f":"\"ได้อนุมัติให้จัดซื้อ\"&'เห็นชอบรวม(น1)'!C5&\" \"&\" โดยวิธีเฉพาะเจาะจง กับร้าน \"&DATABASE!C19","v":"ได้อนุมัติให้จัดซื้อถ่ายเอกสารงานราชการและเข้าเล่ม  โดยวิธีเฉพาะเจาะจง กับร้าน หจก. เอกสารซีพี"}]
{"$rows_left_out":29}
{"sheet":"ใบส่งของ มอบ","index":13,"n_rows":25,"n_cols":16,"rows_kept":25,"cut":false,"hidden":false,"merged":[[24,5,24,10],[17,5,17,8],[6,11,6,13],[6,5,6,7],[22,2,22,4],[23,2,23,4],[23,7,23,9],[11,1,11,3],[13,1,13,2],[0,1,0,10],[1,1,1,10],[2,1,2,10],[8,1,8,10],[3,6,3,9]]}
[null,"ใบส่งมอบงานจ้าง",null,null,null,null,null,null,null,null,null,null,null,{"$f":"DAY(G4)","v":30},{"$f":"MONTH(G4)","v":9},{"$f":"YEAR(G4)","v":2562}]
[null,{"$f":"DATABASE!C19","v":"หจก. เอกสารซีพี"}]
[null,{"$f":"DATABASE!C20&\" \"&DATABASE!D20","v":"95/10-11 ถ.อินจันทร์รรงค์  ต.ในเมือง อ.เมือง จ.บุรีรัมย์ โทรศัพท์ 0 4461 4005"}]
[null,null,null,null,null,"วันที่","2562-09-30"]
[null,"เรื่อง    ","ส่งมอบงานจ้าง และขอเบิกเงิน"]
[null,"เรียน   ",{"$f":"DATABASE!D14","v":"ผู้อำนวยการโรงพยาบาลส่งเสริมสุขภาพตำบลบ้านกระเบื้องน้อย"}]
[null,"อ้างถึง",{"$f":"ใบสั่งจ้าง!E4&\" \"&ใบสั่งจ้าง!F4&\" ลงวันที่\"","v":"ใบสั่งจ้าง เลขที่ 710/2562 ลงวันที่"},null,null,{"$f":"ใบสั่งจ้าง!F5","v":"2562-08-22"}]
[null,null,null,{"$f":"DATABASE!C4&\" \"&DATABASE!D4","v":"สำนักงานสาธารณสุขอำเภอหนองหงส์ อำเภอหนองหงส์  จังหวัดบุรีรัมย์ "}]
{"$rows_left_out":18}
{"sheet":"ใบตรวจรับ","index":14,"n_rows":32,"n_cols":11,"rows_kept":32,"cut":false,"hidden":false,"merged":[[26,6,26,8],[0,1,0,9],[1,1,1,9],[2,6,2,8],[4,1,4,9],[3,6,3,7]]}
[null,"ใบตรวจรับการจ้าง"]
[null,{"$f":"DATABASE!C15","v":"โรงพยาบาลส่งเสริมสุขภาพตำบลบ้านกระเบื้องน้อย"}]
[null,null,null,null,null,"วันที่",{"$f":"'ใบส่งของ มอบ'!G4:J4","v":"2562-09-30"}]
[null,null,{"$f":"\"ตามข้อ \"&ใบสั่งจ้าง!E4&\" \"&ใบสั่งจ้าง!F4&\" ลงวันที่\"","v":"ตามข้อ ใบสั่งจ้าง เลขที่ 710/2562 ลงวันที่"},null,null,null,{"$f":"ใบสั่งจ้าง!F5","v":"2562-08-22"}]
[null,{"$f":"DATABASE!C4&\" \"&DATABASE!D15&\" ได้ตกลงจ้าง \"&'เห็นชอบรวม(น1)'!C5&\" ซึ่ง \"&DATABASE!C19&\" เลขที่ \"&DATABASE!C20&\" โดยวิธีเฉพาะเจาะจง ผู้รับจ้าง ได้ส่งมอบงานจ้างตามหนังสือส่งมอบงานจ้าง (เอกสารแนบ)\"","v":"สำนักงานสาธารณสุขอำเภอหนองหงส์ อำเภอหนองหงส์ จังหวัดบุรีรัมย์ ได้ตกลงจ้าง ถ่ายเอกสารงานราชการและเข้าเล่ม ซึ่ง หจก. เอกสารซีพี เลขที่ 95/10-11 ถ.อินจันทร์รรงค์  ต.ในเมือง อ.เมือง จ.บุรีรัมย์ โดยวิธีเฉพาะเจาะจง ผู้รับจ้าง ได้ส่งมอบงานจ้างตามหนังสือส่งมอบงานจ้าง (เอกสารแนบ)"}]
[null,{"$f":"\"เป็นจำนวนเงินทั้งสิ้น \"&'ใบส่งของ มอบ'!B14&\" \"&'ใบส่งของ มอบ'!D14","v":"เป็นจำนวนเงินทั้งสิ้น 2000 บาท  (สองพันบาทถ้วน)"}]
[null,null,"ผู้ตรวจรับพัสดุ ได้ตรวจรับพัสดุ  ผลปรากฎว่า"]
[null,null,"ผลการตรวจรับ"]
{"$rows_left_out":25}
{"sheet":"ใบสำคัญรับเงิน","index":15,"n_rows":30,"n_cols":10,"rows_kept":30,"cut":false,"hidden":true,"merged":[[23,1,23,7],[23,8,23,9],[27,5,27,8],[29,5,29,8],[20,1,20,7],[20,8,20,9],[21,1,21,7],[21,8,21,9],[22,1,22,7],[22,8,22,9],[17,1,17,7],[17,8,17,9],[18,1,18,7],[18,8,18,9],[19,1,19,7],[19,8,19,9],[14,1,14,7],[14,8,14,9],[15,1,15,7],[15,8,15,9],[16,1,16,7],[16,8,16,9],[11,8,11,9],[12,1,12,7],[12,8,12,9],[13,1,13,7],[13,8,13,9],[11,1,11,7],[0,1,0,9],[1,1,1,9],[3,1,3,9],[5,6,5,9],[6,3,6,5],[10,1,10,7],[10,8,10,9],[7,2,7,3],[7,5,7,6],[7,8,7,9],[8,2,8,7],[9,1,9,7],[9,8,9,9]]}
[null,"แบบใบสำคัญรับเงิน"]
[null,{"$f":"DATABASE!C15","v":"โรงพยาบาลส่งเสริมสุขภาพตำบลบ้านกระเบื้องน้อย"}]
[]
[null,"ใบสำคัญรับเงิน"]
[]
[null,null,null,null,null,"วันที่",{"$f":"ใบสั่งจ้าง!J6","v":"2561-01-29"}]
[null,null,"ข้าพเจ้า",{"$f":"VLOOKUP(รายงานจัดจ้าง!$A$1,CG!$A$11:$B$40,2,0)","v":"นางน้อย ปานเพ็ชร"},null,null,"บ้านเลขที่",{"$f":"VLOOKUP(รายงานจัดจ้าง!$A$1,CG!$A$11:$F$40,3,0)","v":133},"หมู่ที่",{"$f":"VLOOKUP(รายงานจัดจ้าง!$A$1,CG!$A$11:$F$40,4,0)","v":6}]
[null,"ตำบล",{"$f":"VLOOKUP(รายงานจัดจ้าง!$A$1,CG!$A$11:$U$40,12,0)","v":"หนองชัยศรี"},null,"อำเภอ.",{"$f":"VLOOKUP(รายงานจัดจ้าง!$A$1,CG!$A$11:$U$40,13,0)","v":"หนองหงส์"},null,"จังหวัด",{"$f":"VLOOKUP(รายงานจัดจ้าง!$A$1,CG!$A$11:$U$40,14,0)","v":"บุรีรัมย์"}]
{"$rows_left_out":23}
{"sheet":"บริสุทธิ์","index":16,"n_rows":25,"n_cols":7,"rows_kept":25,"cut":false,"hidden":false,"merged":[[24,3,24,5],[0,1,0,5],[1,1,1,5],[2,1,2,5],[3,1,3,5],[4,2,4,4],[5,2,5,4],[6,2,6,4],[7,2,7,4],[8,2,8,4],[9,1,9,5],[10,1,10,5],[23,2,23,5]]}
[null,"แบบแสดงความบริสุทธิ์ใจในการจัดซื้อจัดจ้างของหน่วยงาน (วงเงินเล็กน้อยไม่เกิน 100,000 บาท)"]
[null,"ในการเปิดเผยข้อมูลความขัดแย้งทางผลประโยชน์ของหัวหน้าเจ้าหน้าที่"]
[null," เจ้าหน้าที่ และผู้ตรวจรับพัสดุ"]
[null,"*********************************"]
[null,"ข้าพเจ้า",{"$f":"DATABASE!C7","v":"นางจุรีพร  บัวลอย"},null,null,"หัวหน้าเจ้าหน้าที่"]
[null,"ข้าพเจ้า",{"$f":"DATABASE!C11","v":"นางวรรณเพ็ญ  วศินไพบูลย์วงศ์"},null,null,"เจ้าหน้าที่","เลือกปริ้น"]
[null,"ข้าพเจ้า",{"$f":"DATABASE!C16","v":"นายสมยศ  นงประโคน"},null,null,{"$f":"IF(DATABASE!C17=\"\",DATABASE!B16,\"ประธานกรรมการ\")","v":"ประธานกรรมการ"},"เลือกปริ้น"]
[null,{"$f":"IF(DATABASE!C17=\"\",\"\",\"ข้าพจ้า\")","v":""},{"$f":"IF(DATABASE!C17=\"\",\"\",DATABASE!C17)","v":""},null,null,{"$f":"IF(DATABASE!C17=\"\",\"\",\"กรรมการ\")","v":""},{"$f":"IF(DATABASE!C17=\"\",\"\",\"เลือกปริ้น\")","v":""}]
{"$rows_left_out":18}
{"sheet":"เบิกจ่ายเงินรวม","index":17,"n_rows":32,"n_cols":13,"rows_kept":32,"cut":false,"hidden":false,"merged":[[0,1,0,11],[24,7,24,9],[2,8,2,9],[5,4,5,11],[23,7,23,9]]}
[null,"บันทึกข้อความ"]
[null,"ส่วนราชการ",null,null,{"$f":"DATABASE!C15&\" \"&DATABASE!D15","v":"โรงพยาบาลส่งเสริมสุขภาพตำบลบ้านกระเบื้องน้อย อำเภอหนองหงส์ จังหวัดบุรีรัมย์"}]
[null,"ที่",null,{"$f":"DATABASE!C13","v":"บร 1332.1.4/"},null,".",null,"วันที่","2562-10-01"]
[null,"เรื่อง",null,{"$f":"'เห็นชอบรวม(น1)'!C5","v":"ถ่ายเอกสารงานราชการและเข้าเล่ม"}]
[null,"เรียน",null,{"$f":"DATABASE!D14","v":"ผู้อำนวยการโรงพยาบาลส่งเสริมสุขภาพตำบลบ้านกระเบื้องน้อย"}]
[null,null,null,null,{"$f":"DATABASE!C15&\" \"&DATABASE!D15","v":"โรงพยาบาลส่งเสริมสุขภาพตำบลบ้านกระเบื้องน้อย อำเภอหนองหงส์ จังหวัดบุรีรัมย์"}]
[null,{"$f":"'เห็นชอบรวม(น1)'!C5","v":"ถ่ายเอกสารงานราชการและเข้าเล่ม"},null,null,null,null,null,null,{"$f":"ใบสั่งจ้าง!G82","v":2000},{"$f":"\"บาท \"&\"(\"&BAHTTEXT(I7)&\")\"","v":"บาท (สองพันบาทถ้วน)"}]
[null,null,null,null,"ผู้ตรวจรับพัสดุ ได้ตรวจรับถูกต้องแล้ว ดังเอกสารแนบการเบิกจ่าย ดังนี้",null,null,null,null,null,null,null,"ลงเลขเอกสาร"]
{"$rows_left_out":24}