{"text_format":"1","workbook":"xlsx","n_sheets":15,"sheets":["CHECK","DATABASE","เห็นชอบ","ใบเสนอราคา","รายงานจัดซื้อ","แนบท้ายรายงาน","ใบสั่งซื้อ","การพิจารณา","คำสั่ง","ประกาศ","รายงานข้อ 16","บริสุทธิ์","ใบส่งของ มอบ","ใบตรวจรับ","เบิกจ่ายเงิน"],"not_rendered":{"charts":0,"images":4,"macros":1,"external_links":3,"defined_names":29,"comments":3,"pivot_tables":0},"unopened":[],"bounds":{"document_bytes":16777216,"sheet_cells":100000,"rows_first":2000,"rows_last":500,"rows_between":2000,"halvings":0,"cell_chars":16384,"cell_head_chars":4096},"cells_cut":0,"cells_raw":0,"read":"whole","date_system":"1900"}

{"sheet":"CHECK","index":0,"n_rows":15,"n_cols":11,"rows_kept":15,"cut":false,"hidden":false,"merged":[[0,1,0,10],[1,1,2,1],[1,2,2,2],[1,3,2,3],[1,4,2,4],[1,5,2,5],[1,6,2,6],[1,7,2,7],[1,8,2,8],[1,9,1,10]]}
[null,"ใบตรวจสอบการดำเนิน (การจัดซื้อ)"]
[null,"ที่","รายการ","จาก","ถึง","ว ด ป",null,"CHECK","Detials ERROR (ต้องทำการแก้ไข ดังนี้)","วิธีการ ต้องดำเนินาร"]
[null,null,null,null,null,null,null,null,null,"ก่อน/เท่ากับ วดป.","หลัง/เท่ากับ วดป."]
[null,1,"ขอความเห็นชอบ","รพ.สต.","สสอ.",{"$f":"เห็นชอบ!H4","v":"2562-03-15"},{"$f":"IF(F4<=F6,1,0)","v":1},{"$f":"IF(G4=1,\"OK\",\"ต้องแก้ไข\")","v":"OK"},{"$f":"IF(G4=0,\"ต้องดำเนินการ ก่อน หรือ = รายงานการซื้อ / จ้าง\",\"\")","v":""},{"$f":"IF(G4=0,F6,\"\")","v":""}]
[null,3,"ใบเสนอราคา","ผู้ค้า/ผู้รับจ้าง","รพ.สต./สสอ.",{"$f":"ใบเสนอราคา!D5","v":"2562-03-17"},{"$f":"IF(F5>=F4,1,0)","v":1},{"$f":"IF(G5=1,\"OK\",\"ต้องแก้ไข\")","v":"OK"},{"$f":"IF(G5=0,\"ต้องดำเนินการ หลัง หรือ = ขอความเห็นชอบ\",\"\")","v":""},null,{"$f":"IF(G5=0,F4,\"\")","v":""}]
[null,2,"รายงานการซื้อ/จ้าง","สสอ.","ผวจ.",{"$f":"รายงานจัดซื้อ!H3","v":"2562-03-15"},{"$f":"IF(F6>=F4,1,0)","v":1},{"$f":"IF(G6=1,\"OK\",\"ต้องแก้ไข\")","v":"OK"},{"$f":"IF(G6=0,\"ต้องดำเนินการ หลัง หรือ = ขอความเห็นชอบ\",\"\")","v":""},null,{"$f":"IF(G6=0,F4,\"\")","v":""}]
[null,3,"คำสั่งจังหวัดบุรีรัมย์",null,null,{"$f":"คำสั่ง!E19","v":"วันที่..................................................."},{"$f":"IF(F7>=F6,1,0)","v":1},{"$f":"IF(G7=1,\"OK\",\"ต้องแก้ไข\")","v":"OK"},{"$f":"IF(G7=0,\"ต้องดำเนินการ หลัง หรือ = รายงานการซื้อ/จ้าง\",\"\")","v":""},null,{"$f":"IF(G7=0,F6,\"\")","v":""}]
[null,4,"รายงานผลการพิจารณา","สสอ.","ผวจ.",{"$f":"การพิจารณา!H3","v":"2561-06-18"},{"$f":"IF(F8>=F6,1,0)","v":0},"ต้องแก้ไข",{"$f":"IF(G8=0,\"ต้องดำเนินการ หลัง หรือ = รายงานการซื้อ/จ้าง\",\"\")","v":"ต้องดำเนินการ หลัง หรือ = รายงานการซื้อ/จ้าง"},null,{"$f":"IF(G8=0,F6,\"\")","v":"2562-03-15"}]
[null,5,"ประกาศผลการพิจารณา",null,null,{"$f":"ประกาศ!E86","v":"2560-12-05"},{"$f":"IF(F9>=F8,1,0)","v":0},"ต้องแก้ไข",{"$f":"IF(G9=0,\"ต้องดำเนินการ หลัง หรือ = รายงานผลการพิจารณา\",\"\")","v":"ต้องดำเนินการ หลัง หรือ = รายงานผลการพิจารณา"}]
[null,6,"ใบสั่งซื้อ/จ้าง","สสอ.","ผู้ค้า/ผู้รับจ้าง",{"$f":"ใบสั่งซื้อ!F5","v":"2562-03-18"},{"$f":"IF(F10>=F6,1,0)","v":1},"OK",{"$f":"IF(G10=0,\"ต้องดำเนินการ หลัง หรือ = รายงานซื้อ/จ้าง\",\"\")","v":""},null,{"$f":"IF(G10=0,F6,\"\")","v":""}]
[null,7,"วันรับใบสั่งซื้อ / จ้าง",null,null,{"$f":"ใบสั่งซื้อ!F93","v":"2562-03-18"},{"$f":"IF(F11>=F10,1,0)","v":1},"OK",{"$f":"IF(G11=0,\"ต้องดำเนินการหลัง หรือ = ออกใบสั่งซื้อ/จ้าง\",\"\")","v":""},null,{"$f":"IF(G11=0,F10,\"\")","v":""}]
[null,8,"วันครบกำหนดส่งมอบ",null,null,{"$f":"ใบสั่งซื้อ!J85","v":"2562-03-25"}]
[null,9,"ใบส่งมอบพัสดุ","ผู้ค้า/ผู้รับจ้าง","ผอ.รพ.สต.",{"$f":"'ใบส่งของ มอบ'!H4","v":"2562-03-21"},{"$f":"IF(F13<=F12,1,0)","v":1},"OK",{"$f":"IF(G13=0,\"ส่งมอบงานช้ากว่ากำหนด\",\"\")","v":""},{"$f":"IF(G13=0,F12,\"\")","v":""}]
[null,10,"ใบตรวจรับพัสดุ","สสอ.","ผวจ.",{"$f":"ใบตรวจรับ!G3","v":"2562-03-21"},{"$f":"IF(F14>=F13,1,0)","v":1},"OK",{"$f":"IF(G14=0,\"ต้องตรวจรับ หลัง หรือ = ส่งมอบพัสดุ\",\"\")","v":""},null,{"$f":"IF(G14=0,F13,\"\")","v":""}]
[null,11,"ขออนุม้ติเบิกจ่ายเงิน","จนท.การเงิน","ผอ.รพ.สต.",{"$f":"เบิกจ่ายเงิน!I3","v":"2562-03-22"},{"$f":"IF(F15>=F14,1,0)","v":1},"OK",{"$f":"IF(G15=0,\"ต้องดำเนินการหลัง หรือ = ตรวจรับพัสดุ\",\"\")","v":""},null,{"$f":"IF(G15=0,F14,\"\")","v":""}]

{"sheet":"DATABASE","index":1,"n_rows":26,"n_cols":5,"rows_kept":26,"cut":false,"hidden":false,"merged":[[0,1,0,3]]}
[null,"ข้อมูลทั่วไป (การจัดซื้อ)"]
[null,"หน่วยงานบังคับบัญชา","สำนักงานสาธารณสุขอำเภอหนองหงส์ ถ.ราษฎร์บำรุง จังหวัดบุรีรัมย์ 31240 ","โทร. 0 4466 9276"]
[null,"ที่หนังสือ สสอ.","บร 1332.1/"]
[null,"หน่วยงานบริหาร","สำนักงานสาธารณสุขอำเภอหนองหงส์","อำเภอหนองหงส์  จังหวัดบุรีรัมย์ 31240 "]
[null,"ที่อยู่","ที่อยู่ หมู่ที่ 14 ถนนราษฎร์บำรุง ตำบลสระแก้ว ","โทร. 0 4466 9276, 0 4466 9020"]
[null,"หัวหน้าหน่วยงาน","นายประหยัด  นงประโคน","สาธารณสุขอำเภอหนองหงส์"]
[null,"หัวหน้าเจ้าหน้าที่","นางจุรีพร  บัวลอย","นักวิชาการสาธารณสุข ชำนาญการ"]
[null,"เลขคำสั่ง สป. การอนุมัติจ่ายเงิน","ปฏิบัติตามคำสั่ง สป. ที่ 1895/2561 ลว. 5 มิถุนายน 2561"]
[null,"คำสั่งจังหวัดบุรีรัมย์","ที่ ................................../2561","วันที่..................................................."]
[null,"คำสั่ง มอบอำนาจพัสดุ","คำสั่งจังหวัดบุรีรัมย์ ที่ 27631/2559 ลงวันที่ 24 สิงหาคม 2560"]
[null,"เจ้าหน้าที่","นางวรรณเพ็ญ  วศินไพบูลย์วงศ์","เจ้าพนักงานสาธารณสุข"]
[null,"เจ้าหน้าที่การเงิน","นางสาวกนกรัตน์  พรมมา","เจ้าพนักงานสาธารณสุข"]
[null,"ที่หนังสือ รพ.สต.","บร 1332.1.4/","นายดำรงค์  สีระสูงเนิน","<<<< ชื่อ ผอ.รพ.สต."]
[null,"ผู้อนุมัติจ่ายเงิน","นายดำรงค์  สีระสูงเนิน","ผู้อำนวยการโรงพยาบาลส่งเสริมสุขภาพตำบลบ้านกระเบื้องน้อย"]
[null,"หน่วยงานที่ขออนุมัติ","โรงพยาบาลส่งเสริมสุขภาพตำบลบ้านกระเบื้องน้อย","อำเภอหนองหงส์ จังหวัดบุรีรัมย์"]
[null,"ผู้ตรวจรับพัสดุ","นางสุรินทร์  สีระสูงเนิน","พยาบาลวิชาชีพ ชำนาญการ"]
[null,"กรรมการ"]
[null,"กรรมการ"]
[null,"ห้างร้าน / บริษัท","หจก. ธงชัย โอเอ เซลส์แอนเซอร์วิส",".........................................................."]
[null,"ที่อยู่ผู้รับจ้าง","68/4-5, 70 ถ.ธานี ต.ในเมือง อ.เมือง จ.บุรีรัมย์","โทรศัพท์ 0 4461 2189"]
[null,"เลขผู้เสียภาษี",313539001261,"หลัก"]
[null,"เลขที่บัญชีเงินฝากธนาคาร ",null,"12 หลัก"]
[null,"ชื่อบัญชี "]
[null,"ธนาคาร"]
[null,"เลขที่โครงการใน e-GP"," -"]
[null,"เลขคุมสัญญา"," -"]

{"sheet":"เห็นชอบ","index":2,"n_rows":96,"n_cols":16,"rows_kept":96,"cut":false,"hidden":false,"merged":[[1,1,1,8],[94,7,94,8],[95,7,95,8],[7,1,7,9],[91,7,91,9]]}
[null,null,null,null,null,null,null,null,null,null,null,null,null,{"$f":"DAY(H4)","v":15},{"$f":"MONTH(H4)","v":3},{"$f":"YEAR(H4)","v":2562}]
[null,"บันทึกข้อความ"]
[null,"ส่วนราชการ",null,null,{"$f":"DATABASE!C15&\" \"&DATABASE!D15","v":"โรงพยาบาลส่งเสริมสุขภาพตำบลบ้านกระเบื้องน้อย อำเภอหนองหงส์ จังหวัดบุรีรัมย์"}]
[null,"ที่",{"$f":"DATABASE!C13","v":"บร 1332.1.4/"},null,55,null,"วันที่","2562-03-15"]
[null,"เรื่อง","ซื้อวัสดุคอมพิวเตอร์ (RAM)"]
[null,"เรียน",{"$f":"DATABASE!D6","v":"สาธารณสุขอำเภอหนองหงส์"}]
[null,null,null,null,"ความเป็นมา"]
[null,"                               ด้วยโรงพยาบาลส่งเสริมสุขภาพตำบลบ้านกระเบื้องน้อย ต.หนองชัยศรี มีเครื่องคอมพิวเตอร์ตั้งโต๊ะ ยี่ห้อ LENOVO รุ่นLenovo Think Server TS150 CPU 1xE3-1225 v6 3.3GHz, Lenovo CPU i5-7400 3.0 GHz และ Lenovo CPU i3-7100 3.9 GHz  ซึ่งมี RAM เครื่องละ 4 GB ลง Windows 10 ทุกตัว จากการใช้งาน HOSxP PCU ในการประมวลผล พบว่า เครื่องทำงานช้า เนื่องจากหน่วยความจำเครื่อง (RAM) ไม่เพียงพอ ดังนั้น เพื่อให้การทำงานเป็นไปด้วยความคล่องตัว ไม่ติดขัด จึงเห็นควรซื้อวัสดุคอมพิวเตอร์ คือ หน่วยความจำเครื่อง (RAM) เพื่อเพิ่มประสิทธิภาพการทำงานให้เร็วขึ้น เพื่อใช้ประโยชน์ของทางราชการต่อไป โดยขออนุมัติใช้เงินบำรุงโรงพยาบาลส่งเสริมสุขภาพบ้านกระเบื้องน้อย "]
[null,null,null,null,"ข้อพิจารณา"]
[null,null,null,null,{"$f":"E3&H3& \"มีความประสงค์\"","v":"โรงพยาบาลส่งเสริมสุขภาพตำบลบ้านกระเบื้องน้อย อำเภอหนองหงส์ จังหวัดบุรีรัมย์มีความประสงค์"}]
[null,{"$f":"C5& \"ไม่มีราคากลาง ราคาตามท้องตลาด รายการดังนี้\"","v":"ซื้อวัสดุคอมพิวเตอร์ (RAM)ไม่มีราคากลาง ราคาตามท้องตลาด รายการดังนี้"}]
[null,null,null,{"$f":"IF(แนบท้ายรายงาน!B6=\"\",\"\",แนบท้ายรายงาน!B6)","v":1},{"$f":"IF(D12=\"\",\"\",แนบท้ายรายงาน!C6)","v":"RAM DDR 4 PC 4GB/2400"},null,{"$f":"IF(D12=\"\",\"\",L12&\" \"&M12&\" \"&N12&\"ๆ ละไม่เกิน\"&\"   \"&O12&\" \"&P12&\" รวม\")","v":"จำนวน 3 ตัวๆ ละไม่เกิน   2130 บาท รวม"},null,{"$f":"IF(แนบท้ายรายงาน!C6=\"\",\"\",แนบท้ายรายงาน!I6)","v":6390},{"$f":"IF(แนบท้ายรายงาน!C6=\"\",\"\",\"บาท\")","v":"บาท"},{"$f":"IF(D12=\"\",\"\",\"เลือกปริ้น\")","v":"เลือกปริ้น"},{"$f":"IF(D12=\"\",\"\",\"จำนวน\")","v":"จำนวน"},{"$f":"IF(D12=\"\",\"\",แนบท้ายรายงาน!D6)","v":3},{"$f":"IF(D12=\"\",\"\",แนบท้ายรายงาน!E6)","v":"ตัว"},{"$f":"IF(D12=\"\",\"\",แนบท้ายรายงาน!H6)","v":2130},{"$f":"IF(D12=\"\",\"\",\"บาท\")","v":"บาท"}]
[null,null,null,{"$f":"IF(แนบท้ายรายงาน!B7=\"\",\"\",แนบท้ายรายงาน!B7)","v":""},{"$f":"IF(D13=\"\",\"\",แนบท้ายรายงาน!C7)","v":""},null,{"$f":"IF(D13=\"\",\"\",L13&\" \"&M13&\" \"&N13&\"ๆ ละไม่เกิน\"&\"   \"&O13&\" \"&P13&\" รวม\")","v":""},null,{"$f":"IF(แนบท้ายรายงาน!C7=\"\",\"\",แนบท้ายรายงาน!I7)","v":""},{"$f":"IF(แนบท้ายรายงาน!C7=\"\",\"\",\"บาท\")","v":""},{"$f":"IF(D13=\"\",\"\",\"เลือกปริ้น\")","v":""},{"$f":"IF(D13=\"\",\"\",\"จำนวน\")","v":""},{"$f":"IF(D13=\"\",\"\",แนบท้ายรายงาน!D7)","v":""},{"$f":"IF(D13=\"\",\"\",แนบท้ายรายงาน!E7)","v":""},{"$f":"IF(D13=\"\",\"\",แนบท้ายรายงาน!H7)","v":""},{"$f":"IF(D13=\"\",\"\",\"บาท\")","v":""}]
[null,null,null,{"$f":"IF(แนบท้ายรายงาน!B8=\"\",\"\",แนบท้ายรายงาน!B8)","v":""},{"$f":"IF(D14=\"\",\"\",แนบท้ายรายงาน!C8)","v":""},null,"",null,{"$f":"IF(แนบท้ายรายงาน!C8=\"\",\"\",แนบท้ายรายงาน!I8)","v":""},{"$f":"IF(แนบท้ายรายงาน!C8=\"\",\"\",\"บาท\")","v":""},"","",{"$f":"IF(D14=\"\",\"\",แนบท้ายรายงาน!D8)","v":""},{"$f":"IF(D14=\"\",\"\",แนบท้ายรายงาน!E8)","v":""},{"$f":"IF(D14=\"\",\"\",แนบท้ายรายงาน!H8)","v":""},""]
[null,null,null,{"$f":"IF(แนบท้ายรายงาน!B9=\"\",\"\",แนบท้ายรายงาน!B9)","v":""},{"$f":"IF(D15=\"\",\"\",แนบท้ายรายงาน!C9)","v":""},null,"",null,{"$f":"IF(แนบท้ายรายงาน!C9=\"\",\"\",แนบท้ายรายงาน!I9)","v":""},{"$f":"IF(แนบท้ายรายงาน!C9=\"\",\"\",\"บาท\")","v":""},"","",{"$f":"IF(D15=\"\",\"\",แนบท้ายรายงาน!D9)","v":""},{"$f":"IF(D15=\"\",\"\",แนบท้ายรายงาน!E9)","v":""},{"$f":"IF(D15=\"\",\"\",แนบท้ายรายงาน!H9)","v":""},""]
[null,null,null,{"$f":"IF(แนบท้ายรายงาน!B10=\"\",\"\",แนบท้ายรายงาน!B10)","v":""},{"$f":"IF(D16=\"\",\"\",แนบท้ายรายงาน!C10)","v":""},null,"",null,{"$f":"IF(แนบท้ายรายงาน!C10=\"\",\"\",แนบท้ายรายงาน!I10)","v":""},{"$f":"IF(แนบท้ายรายงาน!C10=\"\",\"\",\"บาท\")","v":""},"","",{"$f":"IF(D16=\"\",\"\",แนบท้ายรายงาน!D10)","v":""},{"$f":"IF(D16=\"\",\"\",แนบท้ายรายงาน!E10)","v":""},{"$f":"IF(D16=\"\",\"\",แนบท้ายรายงาน!H10)","v":""},""]
[null,null,null,{"$f":"IF(แนบท้ายรายงาน!B11=\"\",\"\",แนบท้ายรายงาน!B11)","v":""},{"$f":"IF(D17=\"\",\"\",แนบท้ายรายงาน!C11)","v":""},null,"",null,{"$f":"IF(แนบท้ายรายงาน!C11=\"\",\"\",แนบท้ายรายงาน!I11)","v":""},{"$f":"IF(แนบท้ายรายงาน!C11=\"\",\"\",\"บาท\")","v":""},"","",{"$f":"IF(D17=\"\",\"\",แนบท้ายรายงาน!D11)","v":""},{"$f":"IF(D17=\"\",\"\",แนบท้ายรายงาน!E11)","v":""},{"$f":"IF(D17=\"\",\"\",แนบท้ายรายงาน!H11)","v":""},""]
[null,null,null,{"$f":"IF(แนบท้ายรายงาน!B12=\"\",\"\",แนบท้ายรายงาน!B12)","v":""},{"$f":"IF(D18=\"\",\"\",แนบท้ายรายงาน!C12)","v":""},null,"",null,{"$f":"IF(แนบท้ายรายงาน!C12=\"\",\"\",แนบท้ายรายงาน!I12)","v":""},{"$f":"IF(แนบท้ายรายงาน!C12=\"\",\"\",\"บาท\")","v":""},"","",{"$f":"IF(D18=\"\",\"\",แนบท้ายรายงาน!D12)","v":""},{"$f":"IF(D18=\"\",\"\",แนบท้ายรายงาน!E12)","v":""},{"$f":"IF(D18=\"\",\"\",แนบท้ายรายงาน!H12)","v":""},""]
[null,null,null,{"$f":"IF(แนบท้ายรายงาน!B13=\"\",\"\",แนบท้ายรายงาน!B13)","v":""},{"$f":"IF(D19=\"\",\"\",แนบท้ายรายงาน!C13)","v":""},null,"",null,{"$f":"IF(แนบท้ายรายงาน!C13=\"\",\"\",แนบท้ายรายงาน!I13)","v":""},{"$f":"IF(แนบท้ายรายงาน!C13=\"\",\"\",\"บาท\")","v":""},"","",{"$f":"IF(D19=\"\",\"\",แนบท้ายรายงาน!D13)","v":""},{"$f":"IF(D19=\"\",\"\",แนบท้ายรายงาน!E13)","v":""},{"$f":"IF(D19=\"\",\"\",แนบท้ายรายงาน!H13)","v":""},""]
[null,null,null,{"$f":"IF(แนบท้ายรายงาน!B14=\"\",\"\",แนบท้ายรายงาน!B14)","v":""},{"$f":"IF(D20=\"\",\"\",แนบท้ายรายงาน!C14)","v":""},null,"",null,{"$f":"IF(แนบท้ายรายงาน!C14=\"\",\"\",แนบท้ายรายงาน!I14)","v":""},{"$f":"IF(แนบท้ายรายงาน!C14=\"\",\"\",\"บาท\")","v":""},"","",{"$f":"IF(D20=\"\",\"\",แนบท้ายรายงาน!D14)","v":""},{"$f":"IF(D20=\"\",\"\",แนบท้ายรายงาน!E14)","v":""},{"$f":"IF(D20=\"\",\"\",แนบท้ายรายงาน!H14)","v":""},""]
[null,null,null,{"$f":"IF(แนบท้ายรายงาน!B15=\"\",\"\",แนบท้ายรายงาน!B15)","v":""},{"$f":"IF(D21=\"\",\"\",แนบท้ายรายงาน!C15)","v":""},null,"",null,{"$f":"IF(แนบท้ายรายงาน!C15=\"\",\"\",แนบท้ายรายงาน!I15)","v":""},{"$f":"IF(แนบท้ายรายงาน!C15=\"\",\"\",\"บาท\")","v":""},"","",{"$f":"IF(D21=\"\",\"\",แนบท้ายรายงาน!D15)","v":""},{"$f":"IF(D21=\"\",\"\",แนบท้ายรายงาน!E15)","v":""},{"$f":"IF(D21=\"\",\"\",แนบท้ายรายงาน!H15)","v":""},""]
[null,null,null,{"$f":"IF(แนบท้ายรายงาน!B16=\"\",\"\",แนบท้ายรายงาน!B16)","v":""},{"$f":"IF(D22=\"\",\"\",แนบท้ายรายงาน!C16)","v":""},null,"",null,{"$f":"IF(แนบท้ายรายงาน!C16=\"\",\"\",แนบท้ายรายงาน!I16)","v":""},{"$f":"IF(แนบท้ายรายงาน!C16=\"\",\"\",\"บาท\")","v":""},"","",{"$f":"IF(D22=\"\",\"\",แนบท้ายรายงาน!D16)","v":""},{"$f":"IF(D22=\"\",\"\",แนบท้ายรายงาน!E16)","v":""},{"$f":"IF(D22=\"\",\"\",แนบท้ายรายงาน!H16)","v":""},""]
[null,null,null,{"$f":"IF(แนบท้ายรายงาน!B17=\"\",\"\",แนบท้ายรายงาน!B17)","v":""},{"$f":"IF(D23=\"\",\"\",แนบท้ายรายงาน!C17)","v":""},null,"",null,{"$f":"IF(แนบท้ายรายงาน!C17=\"\",\"\",แนบท้ายรายงาน!I17)","v":""},{"$f":"IF(แนบท้ายรายงาน!C17=\"\",\"\",\"บาท\")","v":""},"","",{"$f":"IF(D23=\"\",\"\",แนบท้ายรายงาน!D17)","v":""},{"$f":"IF(D23=\"\",\"\",แนบท้ายรายงาน!E17)","v":""},{"$f":"IF(D23=\"\",\"\",แนบท้ายรายงาน!H17)","v":""},""]
[null,null,null,{"$f":"IF(แนบท้ายรายงาน!B18=\"\",\"\",แนบท้ายรายงาน!B18)","v":""},{"$f":"IF(D24=\"\",\"\",แนบท้ายรายงาน!C18)","v":""},null,"",null,{"$f":"IF(แนบท้ายรายงาน!C18=\"\",\"\",แนบท้ายรายงาน!I18)","v":""},{"$f":"IF(แนบท้ายรายงาน!C18=\"\",\"\",\"บาท\")","v":""},"","",{"$f":"IF(D24=\"\",\"\",แนบท้ายรายงาน!D18)","v":""},{"$f":"IF(D24=\"\",\"\",แนบท้ายรายงาน!E18)","v":""},{"$f":"IF(D24=\"\",\"\",แนบท้ายรายงาน!H18)","v":""},""]
[null,null,null,{"$f":"IF(แนบท้ายรายงาน!B19=\"\",\"\",แนบท้ายรายงาน!B19)","v":""},{"$f":"IF(D25=\"\",\"\",แนบท้ายรายงาน!C19)","v":""},null,"",null,{"$f":"IF(แนบท้ายรายงาน!C19=\"\",\"\",แนบท้ายรายงาน!I19)","v":""},{"$f":"IF(แนบท้ายรายงาน!C19=\"\",\"\",\"บาท\")","v":""},"",{"$f":"IF(D25=\"\",\"\",\"จำนวน\")","v":""},{"$f":"IF(D25=\"\",\"\",แนบท้ายรายงาน!D19)","v":""},{"$f":"IF(D25=\"\",\"\",แนบท้ายรายงาน!E19)","v":""},{"$f":"IF(D25=\"\",\"\",แนบท้ายรายงาน!H19)","v":""},{"$f":"IF(D25=\"\",\"\",\"บาท\")","v":""}]
[null,null,null,{"$f":"IF(แนบท้ายรายงาน!B20=\"\",\"\",แนบท้ายรายงาน!B20)","v":""},{"$f":"IF(D26=\"\",\"\",แนบท้ายรายงาน!C20)","v":""},null,"",null,{"$f":"IF(แนบท้ายรายงาน!C20=\"\",\"\",แนบท้ายรายงาน!I20)","v":""},{"$f":"IF(แนบท้ายรายงาน!C20=\"\",\"\",\"บาท\")","v":""},"","",{"$f":"IF(D26=\"\",\"\",แนบท้ายรายงาน!D20)","v":""},{"$f":"IF(D26=\"\",\"\",แนบท้ายรายงาน!E20)","v":""},{"$f":"IF(D26=\"\",\"\",แนบท้ายรายงาน!H20)","v":""},""]
[null,null,null,{"$f":"IF(แนบท้ายรายงาน!B21=\"\",\"\",แนบท้ายรายงาน!B21)","v":""},{"$f":"IF(D27=\"\",\"\",แนบท้ายรายงาน!C21)","v":""},null,"",null,{"$f":"IF(แนบท้ายรายงาน!C21=\"\",\"\",แนบท้ายรายงาน!I21)","v":""},{"$f":"IF(แนบท้ายรายงาน!C21=\"\",\"\",\"บาท\")","v":""},"","",{"$f":"IF(D27=\"\",\"\",แนบท้ายรายงาน!D21)","v":""},{"$f":"IF(D27=\"\",\"\",แนบท้ายรายงาน!E21)","v":""},{"$f":"IF(D27=\"\",\"\",แนบท้ายรายงาน!H21)","v":""},""]
[null,null,null,{"$f":"IF(แนบท้ายรายงาน!B22=\"\",\"\",แนบท้ายรายงาน!B22)","v":""},{"$f":"IF(D28=\"\",\"\",แนบท้ายรายงาน!C22)","v":""},null,"",null,{"$f":"IF(แนบท้ายรายงาน!C22=\"\",\"\",แนบท้ายรายงาน!I22)","v":""},{"$f":"IF(แนบท้ายรายงาน!C22=\"\",\"\",\"บาท\")","v":""},"","",{"$f":"IF(D28=\"\",\"\",แนบท้ายรายงาน!D22)","v":""},{"$f":"IF(D28=\"\",\"\",แนบท้ายรายงาน!E22)","v":""},{"$f":"IF(D28=\"\",\"\",แนบท้ายรายงาน!H22)","v":""},""]
[null,null,null,{"$f":"IF(แนบท้ายรายงาน!B23=\"\",\"\",แนบท้ายรายงาน!B23)","v":""},{"$f":"IF(D29=\"\",\"\",แนบท้ายรายงาน!C23)","v":""},null,"",null,{"$f":"IF(แนบท้ายรายงาน!C23=\"\",\"\",แนบท้ายรายงาน!I23)","v":""},{"$f":"IF(แนบท้ายรายงาน!C23=\"\",\"\",\"บาท\")","v":""},"","",{"$f":"IF(D29=\"\",\"\",แนบท้ายรายงาน!D23)","v":""},{"$f":"IF(D29=\"\",\"\",แนบท้ายรายงาน!E23)","v":""},{"$f":"IF(D29=\"\",\"\",แนบท้ายรายงาน!H23)","v":""},""]
[null,null,null,{"$f":"IF(แนบท้ายรายงาน!B24=\"\",\"\",แนบท้ายรายงาน!B24)","v":""},{"$f":"IF(D30=\"\",\"\",แนบท้ายรายงาน!C24)","v":""},null,"",null,{"$f":"IF(แนบท้ายรายงาน!C24=\"\",\"\",แนบท้ายรายงาน!I24)","v":""},{"$f":"IF(แนบท้ายรายงาน!C24=\"\",\"\",\"บาท\")","v":""},"","",{"$f":"IF(D30=\"\",\"\",แนบท้ายรายงาน!D24)","v":""},{"$f":"IF(D30=\"\",\"\",แนบท้ายรายงาน!E24)","v":""},{"$f":"IF(D30=\"\",\"\",แนบท้ายรายงาน!H24)","v":""},""]
[null,null,null,{"$f":"IF(แนบท้ายรายงาน!B25=\"\",\"\",แนบท้ายรายงาน!B25)","v":""},{"$f":"IF(D31=\"\",\"\",แนบท้ายรายงาน!C25)","v":""},null,"",null,{"$f":"IF(แนบท้ายรายงาน!C25=\"\",\"\",แนบท้ายรายงาน!I25)","v":""},{"$f":"IF(แนบท้ายรายงาน!C25=\"\",\"\",\"บาท\")","v":""},"","",{"$f":"IF(D31=\"\",\"\",แนบท้ายรายงาน!D25)","v":""},{"$f":"IF(D31=\"\",\"\",แนบท้ายรายงาน!E25)","v":""},{"$f":"IF(D31=\"\",\"\",แนบท้ายรายงาน!H25)","v":""},""]
[null,null,null,{"$f":"IF(แนบท้ายรายงาน!B26=\"\",\"\",แนบท้ายรายงาน!B26)","v":""},{"$f":"IF(D32=\"\",\"\",แนบท้ายรายงาน!C26)","v":""},null,"",null,{"$f":"IF(แนบท้ายรายงาน!C26=\"\",\"\",แนบท้ายรายงาน!I26)","v":""},{"$f":"IF(แนบท้ายรายงาน!C26=\"\",\"\",\"บาท\")","v":""},"","",{"$f":"IF(D32=\"\",\"\",แนบท้ายรายงาน!D26)","v":""},{"$f":"IF(D32=\"\",\"\",แนบท้ายรายงาน!E26)","v":""},{"$f":"IF(D32=\"\",\"\",แนบท้ายรายงาน!H26)","v":""},""]
[null,null,null,{"$f":"IF(แนบท้ายรายงาน!B27=\"\",\"\",แนบท้ายรายงาน!B27)","v":""},{"$f":"IF(D33=\"\",\"\",แนบท้ายรายงาน!C27)","v":""},null,"",null,{"$f":"IF(แนบท้ายรายงาน!C27=\"\",\"\",แนบท้ายรายงาน!I27)","v":""},{"$f":"IF(แนบท้ายรายงาน!C27=\"\",\"\",\"บาท\")","v":""},"","",{"$f":"IF(D33=\"\",\"\",แนบท้ายรายงาน!D27)","v":""},{"$f":"IF(D33=\"\",\"\",แนบท้ายรายงาน!E27)","v":""},{"$f":"IF(D33=\"\",\"\",แนบท้ายรายงาน!H27)","v":""},""]
[null,null,null,{"$f":"IF(แนบท้ายรายงาน!B28=\"\",\"\",แนบท้ายรายงาน!B28)","v":""},{"$f":"IF(D34=\"\",\"\",แนบท้ายรายงาน!C28)","v":""},null,"",null,{"$f":"IF(แนบท้ายรายงาน!C28=\"\",\"\",แนบท้ายรายงาน!I28)","v":""},{"$f":"IF(แนบท้ายรายงาน!C28=\"\",\"\",\"บาท\")","v":""},"","",{"$f":"IF(D34=\"\",\"\",แนบท้ายรายงาน!D28)","v":""},{"$f":"IF(D34=\"\",\"\",แนบท้ายรายงาน!E28)","v":""},{"$f":"IF(D34=\"\",\"\",แนบท้ายรายงาน!H28)","v":""},""]
[null,null,null,{"$f":"IF(แนบท้ายรายงาน!B29=\"\",\"\",แนบท้ายรายงาน!B29)","v":""},{"$f":"IF(D35=\"\",\"\",แนบท้ายรายงาน!C29)","v":""},null,"",null,{"$f":"IF(แนบท้ายรายงาน!C29=\"\",\"\",แนบท้ายรายงาน!I29)","v":""},{"$f":"IF(แนบท้ายรายงาน!C29=\"\",\"\",\"บาท\")","v":""},"","",{"$f":"IF(D35=\"\",\"\",แนบท้ายรายงาน!D29)","v":""},{"$f":"IF(D35=\"\",\"\",แนบท้ายรายงาน!E29)","v":""},{"$f":"IF(D35=\"\",\"\",แนบท้ายรายงาน!H29)","v":""},""]
[null,null,null,{"$f":"IF(แนบท้ายรายงาน!B30=\"\",\"\",แนบท้ายรายงาน!B30)","v":""},{"$f":"IF(D36=\"\",\"\",แนบท้ายรายงาน!C30)","v":""},null,"",null,{"$f":"IF(แนบท้ายรายงาน!C30=\"\",\"\",แนบท้ายรายงาน!I30)","v":""},{"$f":"IF(แนบท้ายรายงาน!C30=\"\",\"\",\"บาท\")","v":""},"","",{"$f":"IF(D36=\"\",\"\",แนบท้ายรายงาน!D30)","v":""},{"$f":"IF(D36=\"\",\"\",แนบท้ายรายงาน!E30)","v":""},{"$f":"IF(D36=\"\",\"\",แนบท้ายรายงาน!H30)","v":""},""]
[null,null,null,{"$f":"IF(แนบท้ายรายงาน!B31=\"\",\"\",แนบท้ายรายงาน!B31)","v":""},{"$f":"IF(D37=\"\",\"\",แนบท้ายรายงาน!C31)","v":""},null,"",null,{"$f":"IF(แนบท้ายรายงาน!C31=\"\",\"\",แนบท้ายรายงาน!I31)","v":""},{"$f":"IF(แนบท้ายรายงาน!C31=\"\",\"\",\"บาท\")","v":""},"","",{"$f":"IF(D37=\"\",\"\",แนบท้ายรายงาน!D31)","v":""},{"$f":"IF(D37=\"\",\"\",แนบท้ายรายงาน!E31)","v":""},{"$f":"IF(D37=\"\",\"\",แนบท้ายรายงาน!H31)","v":""},""]
[null,null,null,{"$f":"IF(แนบท้ายรายงาน!B32=\"\",\"\",แนบท้ายรายงาน!B32)","v":""},{"$f":"IF(D38=\"\",\"\",แนบท้ายรายงาน!C32)","v":""},null,"",null,{"$f":"IF(แนบท้ายรายงาน!C32=\"\",\"\",แนบท้ายรายงาน!I32)","v":""},{"$f":"IF(แนบท้ายรายงาน!C32=\"\",\"\",\"บาท\")","v":""},"","",{"$f":"IF(D38=\"\",\"\",แนบท้ายรายงาน!D32)","v":""},{"$f":"IF(D38=\"\",\"\",แนบท้ายรายงาน!E32)","v":""},{"$f":"IF(D38=\"\",\"\",แนบท้ายรายงาน!H32)","v":""},""]
[null,null,null,{"$f":"IF(แนบท้ายรายงาน!B33=\"\",\"\",แนบท้ายรายงาน!B33)","v":""},{"$f":"IF(D39=\"\",\"\",แนบท้ายรายงาน!C33)","v":""},null,"",null,{"$f":"IF(แนบท้ายรายงาน!C33=\"\",\"\",แนบท้ายรายงาน!I33)","v":""},{"$f":"IF(แนบท้ายรายงาน!C33=\"\",\"\",\"บาท\")","v":""},"","",{"$f":"IF(D39=\"\",\"\",แนบท้ายรายงาน!D33)","v":""},{"$f":"IF(D39=\"\",\"\",แนบท้ายรายงาน!E33)","v":""},{"$f":"IF(D39=\"\",\"\",แนบท้ายรายงาน!H33)","v":""},""]
[null,null,null,{"$f":"IF(แนบท้ายรายงาน!B34=\"\",\"\",แนบท้ายรายงาน!B34)","v":""},{"$f":"IF(D40=\"\",\"\",แนบท้ายรายงาน!C34)","v":""},null,"",null,{"$f":"IF(แนบท้ายรายงาน!C34=\"\",\"\",แนบท้ายรายงาน!I34)","v":""},{"$f":"IF(แนบท้ายรายงาน!C34=\"\",\"\",\"บาท\")","v":""},"","",{"$f":"IF(D40=\"\",\"\",แนบท้ายรายงาน!D34)","v":""},{"$f":"IF(D40=\"\",\"\",แนบท้ายรายงาน!E34)","v":""},{"$f":"IF(D40=\"\",\"\",แนบท้ายรายงาน!H34)","v":""},""]
[null,null,null,{"$f":"IF(แนบท้ายรายงาน!B35=\"\",\"\",แนบท้ายรายงาน!B35)","v":""},{"$f":"IF(D41=\"\",\"\",แนบท้ายรายงาน!C35)","v":""},null,"",null,{"$f":"IF(แนบท้ายรายงาน!C35=\"\",\"\",แนบท้ายรายงาน!I35)","v":""},{"$f":"IF(แนบท้ายรายงาน!C35=\"\",\"\",\"บาท\")","v":""},"","",{"$f":"IF(D41=\"\",\"\",แนบท้ายรายงาน!D35)","v":""},{"$f":"IF(D41=\"\",\"\",แนบท้ายรายงาน!E35)","v":""},{"$f":"IF(D41=\"\",\"\",แนบท้ายรายงาน!H35)","v":""},""]
[null,null,null,{"$f":"IF(แนบท้ายรายงาน!B36=\"\",\"\",แนบท้ายรายงาน!B36)","v":""},{"$f":"IF(D42=\"\",\"\",แนบท้ายรายงาน!C36)","v":""},null,"",null,{"$f":"IF(แนบท้ายรายงาน!C36=\"\",\"\",แนบท้ายรายงาน!I36)","v":""},{"$f":"IF(แนบท้ายรายงาน!C36=\"\",\"\",\"บาท\")","v":""},"","",{"$f":"IF(D42=\"\",\"\",แนบท้ายรายงาน!D36)","v":""},{"$f":"IF(D42=\"\",\"\",แนบท้ายรายงาน!E36)","v":""},{"$f":"IF(D42=\"\",\"\",แนบท้ายรายงาน!H36)","v":""},""]
[null,null,null,{"$f":"IF(แนบท้ายรายงาน!B37=\"\",\"\",แนบท้ายรายงาน!B37)","v":""},{"$f":"IF(D43=\"\",\"\",แนบท้ายรายงาน!C37)","v":""},null,"",null,{"$f":"IF(แนบท้ายรายงาน!C37=\"\",\"\",แนบท้ายรายงาน!I37)","v":""},{"$f":"IF(แนบท้ายรายงาน!C37=\"\",\"\",\"บาท\")","v":""},"","",{"$f":"IF(D43=\"\",\"\",แนบท้ายรายงาน!D37)","v":""},{"$f":"IF(D43=\"\",\"\",แนบท้ายรายงาน!E37)","v":""},{"$f":"IF(D43=\"\",\"\",แนบท้ายรายงาน!H37)","v":""},""]
[null,null,null,{"$f":"IF(แนบท้ายรายงาน!B38=\"\",\"\",แนบท้ายรายงาน!B38)","v":""},{"$f":"IF(D44=\"\",\"\",แนบท้ายรายงาน!C38)","v":""},null,"",null,{"$f":"IF(แนบท้ายรายงาน!C38=\"\",\"\",แนบท้ายรายงาน!I38)","v":""},{"$f":"IF(แนบท้ายรายงาน!C38=\"\",\"\",\"บาท\")","v":""},"","",{"$f":"IF(D44=\"\",\"\",แนบท้ายรายงาน!D38)","v":""},{"$f":"IF(D44=\"\",\"\",แนบท้ายรายงาน!E38)","v":""},{"$f":"IF(D44=\"\",\"\",แนบท้ายรายงาน!H38)","v":""},""]
[null,null,null,{"$f":"IF(แนบท้ายรายงาน!B39=\"\",\"\",แนบท้ายรายงาน!B39)","v":""},{"$f":"IF(D45=\"\",\"\",แนบท้ายรายงาน!C39)","v":""},null,"",null,{"$f":"IF(แนบท้ายรายงาน!C39=\"\",\"\",แนบท้ายรายงาน!I39)","v":""},{"$f":"IF(แนบท้ายรายงาน!C39=\"\",\"\",\"บาท\")","v":""},"","",{"$f":"IF(D45=\"\",\"\",แนบท้ายรายงาน!D39)","v":""},{"$f":"IF(D45=\"\",\"\",แนบท้ายรายงาน!E39)","v":""},{"$f":"IF(D45=\"\",\"\",แนบท้ายรายงาน!H39)","v":""},""]
[null,null,null,{"$f":"IF(แนบท้ายรายงาน!B40=\"\",\"\",แนบท้ายรายงาน!B40)","v":""},{"$f":"IF(D46=\"\",\"\",แนบท้ายรายงาน!C40)","v":""},null,"",null,{"$f":"IF(แนบท้ายรายงาน!C40=\"\",\"\",แนบท้ายรายงาน!I40)","v":""},{"$f":"IF(แนบท้ายรายงาน!C40=\"\",\"\",\"บาท\")","v":""},"","",{"$f":"IF(D46=\"\",\"\",แนบท้ายรายงาน!D40)","v":""},{"$f":"IF(D46=\"\",\"\",แนบท้ายรายงาน!E40)","v":""},{"$f":"IF(D46=\"\",\"\",แนบท้ายรายงาน!H40)","v":""},""]
[null,null,null,{"$f":"IF(แนบท้ายรายงาน!B41=\"\",\"\",แนบท้ายรายงาน!B41)","v":""},{"$f":"IF(D47=\"\",\"\",แนบท้ายรายงาน!C41)","v":""},null,"",null,{"$f":"IF(แนบท้ายรายงาน!C41=\"\",\"\",แนบท้ายรายงาน!I41)","v":""},{"$f":"IF(แนบท้ายรายงาน!C41=\"\",\"\",\"บาท\")","v":""},"","",{"$f":"IF(D47=\"\",\"\",แนบท้ายรายงาน!D41)","v":""},{"$f":"IF(D47=\"\",\"\",แนบท้ายรายงาน!E41)","v":""},{"$f":"IF(D47=\"\",\"\",แนบท้ายรายงาน!H41)","v":""},""]
[null,null,null,{"$f":"IF(แนบท้ายรายงาน!B42=\"\",\"\",แนบท้ายรายงาน!B42)","v":""},{"$f":"IF(D48=\"\",\"\",แนบท้ายรายงาน!C42)","v":""},null,"",null,{"$f":"IF(แนบท้ายรายงาน!C42=\"\",\"\",แนบท้ายรายงาน!I42)","v":""},{"$f":"IF(แนบท้ายรายงาน!C42=\"\",\"\",\"บาท\")","v":""},"","",{"$f":"IF(D48=\"\",\"\",แนบท้ายรายงาน!D42)","v":""},{"$f":"IF(D48=\"\",\"\",แนบท้ายรายงาน!E42)","v":""},{"$f":"IF(D48=\"\",\"\",แนบท้ายรายงาน!H42)","v":""},""]
[null,null,null,{"$f":"IF(แนบท้ายรายงาน!B43=\"\",\"\",แนบท้ายรายงาน!B43)","v":""},{"$f":"IF(D49=\"\",\"\",แนบท้ายรายงาน!C43)","v":""},null,"",null,{"$f":"IF(แนบท้ายรายงาน!C43=\"\",\"\",แนบท้ายรายงาน!I43)","v":""},{"$f":"IF(แนบท้ายรายงาน!C43=\"\",\"\",\"บาท\")","v":""},"","",{"$f":"IF(D49=\"\",\"\",แนบท้ายรายงาน!D43)","v":""},{"$f":"IF(D49=\"\",\"\",แนบท้ายรายงาน!E43)","v":""},{"$f":"IF(D49=\"\",\"\",แนบท้ายรายงาน!H43)","v":""},""]
[null,null,null,{"$f":"IF(แนบท้ายรายงาน!B44=\"\",\"\",แนบท้ายรายงาน!B44)","v":""},{"$f":"IF(D50=\"\",\"\",แนบท้ายรายงาน!C44)","v":""},null,"",null,{"$f":"IF(แนบท้ายรายงาน!C44=\"\",\"\",แนบท้ายรายงาน!I44)","v":""},{"$f":"IF(แนบท้ายรายงาน!C44=\"\",\"\",\"บาท\")","v":""},"","",{"$f":"IF(D50=\"\",\"\",แนบท้ายรายงาน!D44)","v":""},{"$f":"IF(D50=\"\",\"\",แนบท้ายรายงาน!E44)","v":""},{"$f":"IF(D50=\"\",\"\",แนบท้ายรายงาน!H44)","v":""},""]
[null,null,null,{"$f":"IF(แนบท้ายรายงาน!B45=\"\",\"\",แนบท้ายรายงาน!B45)","v":""},{"$f":"IF(D51=\"\",\"\",แนบท้ายรายงาน!C45)","v":""},null,"",null,{"$f":"IF(แนบท้ายรายงาน!C45=\"\",\"\",แนบท้ายรายงาน!I45)","v":""},{"$f":"IF(แนบท้ายรายงาน!C45=\"\",\"\",\"บาท\")","v":""},"","",{"$f":"IF(D51=\"\",\"\",แนบท้ายรายงาน!D45)","v":""},{"$f":"IF(D51=\"\",\"\",แนบท้ายรายงาน!E45)","v":""},{"$f":"IF(D51=\"\",\"\",แนบท้ายรายงาน!H45)","v":""},""]
[null,null,null,{"$f":"IF(แนบท้ายรายงาน!B46=\"\",\"\",แนบท้ายรายงาน!B46)","v":""},{"$f":"IF(D52=\"\",\"\",แนบท้ายรายงาน!C46)","v":""},null,"",null,{"$f":"IF(แนบท้ายรายงาน!C46=\"\",\"\",แนบท้ายรายงาน!I46)","v":""},{"$f":"IF(แนบท้ายรายงาน!C46=\"\",\"\",\"บาท\")","v":""},"","",{"$f":"IF(D52=\"\",\"\",แนบท้ายรายงาน!D46)","v":""},{"$f":"IF(D52=\"\",\"\",แนบท้ายรายงาน!E46)","v":""},{"$f":"IF(D52=\"\",\"\",แนบท้ายรายงาน!H46)","v":""},""]
[null,null,null,{"$f":"IF(แนบท้ายรายงาน!B47=\"\",\"\",แนบท้ายรายงาน!B47)","v":""},{"$f":"IF(D53=\"\",\"\",แนบท้ายรายงาน!C47)","v":""},null,"",null,{"$f":"IF(แนบท้ายรายงาน!C47=\"\",\"\",แนบท้ายรายงาน!I47)","v":""},{"$f":"IF(แนบท้ายรายงาน!C47=\"\",\"\",\"บาท\")","v":""},"","",{"$f":"IF(D53=\"\",\"\",แนบท้ายรายงาน!D47)","v":""},{"$f":"IF(D53=\"\",\"\",แนบท้ายรายงาน!E47)","v":""},{"$f":"IF(D53=\"\",\"\",แนบท้ายรายงาน!H47)","v":""},""]
[null,null,null,{"$f":"IF(แนบท้ายรายงาน!B48=\"\",\"\",แนบท้ายรายงาน!B48)","v":""},{"$f":"IF(D54=\"\",\"\",แนบท้ายรายงาน!C48)","v":""},null,"",null,{"$f":"IF(แนบท้ายรายงาน!C48=\"\",\"\",แนบท้ายรายงาน!I48)","v":""},{"$f":"IF(แนบท้ายรายงาน!C48=\"\",\"\",\"บาท\")","v":""},"","",{"$f":"IF(D54=\"\",\"\",แนบท้ายรายงาน!D48)","v":""},{"$f":"IF(D54=\"\",\"\",แนบท้ายรายงาน!E48)","v":""},{"$f":"IF(D54=\"\",\"\",แนบท้ายรายงาน!H48)","v":""},""]
[null,null,null,{"$f":"IF(แนบท้ายรายงาน!B49=\"\",\"\",แนบท้ายรายงาน!B49)","v":""},{"$f":"IF(D55=\"\",\"\",แนบท้ายรายงาน!C49)","v":""},null,"",null,{"$f":"IF(แนบท้ายรายงาน!C49=\"\",\"\",แนบท้ายรายงาน!I49)","v":""},{"$f":"IF(แนบท้ายรายงาน!C49=\"\",\"\",\"บาท\")","v":""},"","",{"$f":"IF(D55=\"\",\"\",แนบท้ายรายงาน!D49)","v":""},{"$f":"IF(D55=\"\",\"\",แนบท้ายรายงาน!E49)","v":""},{"$f":"IF(D55=\"\",\"\",แนบท้ายรายงาน!H49)","v":""},""]
[null,null,null,{"$f":"IF(แนบท้ายรายงาน!B50=\"\",\"\",แนบท้ายรายงาน!B50)","v":""},{"$f":"IF(D56=\"\",\"\",แนบท้ายรายงาน!C50)","v":""},null,"",null,{"$f":"IF(แนบท้ายรายงาน!C50=\"\",\"\",แนบท้ายรายงาน!I50)","v":""},{"$f":"IF(แนบท้ายรายงาน!C50=\"\",\"\",\"บาท\")","v":""},"","",{"$f":"IF(D56=\"\",\"\",แนบท้ายรายงาน!D50)","v":""},{"$f":"IF(D56=\"\",\"\",แนบท้ายรายงาน!E50)","v":""},{"$f":"IF(D56=\"\",\"\",แนบท้ายรายงาน!H50)","v":""},""]
[null,null,null,{"$f":"IF(แนบท้ายรายงาน!B51=\"\",\"\",แนบท้ายรายงาน!B51)","v":""},{"$f":"IF(D57=\"\",\"\",แนบท้ายรายงาน!C51)","v":""},null,"",null,{"$f":"IF(แนบท้ายรายงาน!C51=\"\",\"\",แนบท้ายรายงาน!I51)","v":""},{"$f":"IF(แนบท้ายรายงาน!C51=\"\",\"\",\"บาท\")","v":""},"","",{"$f":"IF(D57=\"\",\"\",แนบท้ายรายงาน!D51)","v":""},{"$f":"IF(D57=\"\",\"\",แนบท้ายรายงาน!E51)","v":""},{"$f":"IF(D57=\"\",\"\",แนบท้ายรายงาน!H51)","v":""},""]
[null,null,null,{"$f":"IF(แนบท้ายรายงาน!B52=\"\",\"\",แนบท้ายรายงาน!B52)","v":""},{"$f":"IF(D58=\"\",\"\",แนบท้ายรายงาน!C52)","v":""},null,"",null,{"$f":"IF(แนบท้ายรายงาน!C52=\"\",\"\",แนบท้ายรายงาน!I52)","v":""},{"$f":"IF(แนบท้ายรายงาน!C52=\"\",\"\",\"บาท\")","v":""},"","",{"$f":"IF(D58=\"\",\"\",แนบท้ายรายงาน!D52)","v":""},{"$f":"IF(D58=\"\",\"\",แนบท้ายรายงาน!E52)","v":""},{"$f":"IF(D58=\"\",\"\",แนบท้ายรายงาน!H52)","v":""},""]
[null,null,null,{"$f":"IF(แนบท้ายรายงาน!B53=\"\",\"\",แนบท้ายรายงาน!B53)","v":""},{"$f":"IF(D59=\"\",\"\",แนบท้ายรายงาน!C53)","v":""},null,"",null,{"$f":"IF(แนบท้ายรายงาน!C53=\"\",\"\",แนบท้ายรายงาน!I53)","v":""},{"$f":"IF(แนบท้ายรายงาน!C53=\"\",\"\",\"บาท\")","v":""},"","",{"$f":"IF(D59=\"\",\"\",แนบท้ายรายงาน!D53)","v":""},{"$f":"IF(D59=\"\",\"\",แนบท้ายรายงาน!E53)","v":""},{"$f":"IF(D59=\"\",\"\",แนบท้ายรายงาน!H53)","v":""},""]
[null,null,null,{"$f":"IF(แนบท้ายรายงาน!B54=\"\",\"\",แนบท้ายรายงาน!B54)","v":""},{"$f":"IF(D60=\"\",\"\",แนบท้ายรายงาน!C54)","v":""},null,"",null,{"$f":"IF(แนบท้ายรายงาน!C54=\"\",\"\",แนบท้ายรายงาน!I54)","v":""},{"$f":"IF(แนบท้ายรายงาน!C54=\"\",\"\",\"บาท\")","v":""},"","",{"$f":"IF(D60=\"\",\"\",แนบท้ายรายงาน!D54)","v":""},{"$f":"IF(D60=\"\",\"\",แนบท้ายรายงาน!E54)","v":""},{"$f":"IF(D60=\"\",\"\",แนบท้ายรายงาน!H54)","v":""},""]
[null,null,null,{"$f":"IF(แนบท้ายรายงาน!B55=\"\",\"\",แนบท้ายรายงาน!B55)","v":""},{"$f":"IF(D61=\"\",\"\",แนบท้ายรายงาน!C55)","v":""},null,"",null,{"$f":"IF(แนบท้ายรายงาน!C55=\"\",\"\",แนบท้ายรายงาน!I55)","v":""},{"$f":"IF(แนบท้ายรายงาน!C55=\"\",\"\",\"บาท\")","v":""},"","",{"$f":"IF(D61=\"\",\"\",แนบท้ายรายงาน!D55)","v":""},{"$f":"IF(D61=\"\",\"\",แนบท้ายรายงาน!E55)","v":""},{"$f":"IF(D61=\"\",\"\",แนบท้ายรายงาน!H55)","v":""},""]
[null,null,null,{"$f":"IF(แนบท้ายรายงาน!B56=\"\",\"\",แนบท้ายรายงาน!B56)","v":""},{"$f":"IF(D62=\"\",\"\",แนบท้ายรายงาน!C56)","v":""},null,"",null,{"$f":"IF(แนบท้ายรายงาน!C56=\"\",\"\",แนบท้ายรายงาน!I56)","v":""},{"$f":"IF(แนบท้ายรายงาน!C56=\"\",\"\",\"บาท\")","v":""},"","",{"$f":"IF(D62=\"\",\"\",แนบท้ายรายงาน!D56)","v":""},{"$f":"IF(D62=\"\",\"\",แนบท้ายรายงาน!E56)","v":""},{"$f":"IF(D62=\"\",\"\",แนบท้ายรายงาน!H56)","v":""},""]
[null,null,null,{"$f":"IF(แนบท้ายรายงาน!B57=\"\",\"\",แนบท้ายรายงาน!B57)","v":""},{"$f":"IF(D63=\"\",\"\",แนบท้ายรายงาน!C57)","v":""},null,"",null,{"$f":"IF(แนบท้ายรายงาน!C57=\"\",\"\",แนบท้ายรายงาน!I57)","v":""},{"$f":"IF(แนบท้ายรายงาน!C57=\"\",\"\",\"บาท\")","v":""},"","",{"$f":"IF(D63=\"\",\"\",แนบท้ายรายงาน!D57)","v":""},{"$f":"IF(D63=\"\",\"\",แนบท้ายรายงาน!E57)","v":""},{"$f":"IF(D63=\"\",\"\",แนบท้ายรายงาน!H57)","v":""},""]
[null,null,null,{"$f":"IF(แนบท้ายรายงาน!B58=\"\",\"\",แนบท้ายรายงาน!B58)","v":""},{"$f":"IF(D64=\"\",\"\",แนบท้ายรายงาน!C58)","v":""},null,"",null,{"$f":"IF(แนบท้ายรายงาน!C58=\"\",\"\",แนบท้ายรายงาน!I58)","v":""},{"$f":"IF(แนบท้ายรายงาน!C58=\"\",\"\",\"บาท\")","v":""},"","",{"$f":"IF(D64=\"\",\"\",แนบท้ายรายงาน!D58)","v":""},{"$f":"IF(D64=\"\",\"\",แนบท้ายรายงาน!E58)","v":""},{"$f":"IF(D64=\"\",\"\",แนบท้ายรายงาน!H58)","v":""},""]
[null,null,null,{"$f":"IF(แนบท้ายรายงาน!B59=\"\",\"\",แนบท้ายรายงาน!B59)","v":""},{"$f":"IF(D65=\"\",\"\",แนบท้ายรายงาน!C59)","v":""},null,"",null,{"$f":"IF(แนบท้ายรายงาน!C59=\"\",\"\",แนบท้ายรายงาน!I59)","v":""},{"$f":"IF(แนบท้ายรายงาน!C59=\"\",\"\",\"บาท\")","v":""},"","",{"$f":"IF(D65=\"\",\"\",แนบท้ายรายงาน!D59)","v":""},{"$f":"IF(D65=\"\",\"\",แนบท้ายรายงาน!E59)","v":""},{"$f":"IF(D65=\"\",\"\",แนบท้ายรายงาน!H59)","v":""},""]
[null,null,null,{"$f":"IF(แนบท้ายรายงาน!B60=\"\",\"\",แนบท้ายรายงาน!B60)","v":""},{"$f":"IF(D66=\"\",\"\",แนบท้ายรายงาน!C60)","v":""},null,"",null,{"$f":"IF(แนบท้ายรายงาน!C60=\"\",\"\",แนบท้ายรายงาน!I60)","v":""},{"$f":"IF(แนบท้ายรายงาน!C60=\"\",\"\",\"บาท\")","v":""},"","",{"$f":"IF(D66=\"\",\"\",แนบท้ายรายงาน!D60)","v":""},{"$f":"IF(D66=\"\",\"\",แนบท้ายรายงาน!E60)","v":""},{"$f":"IF(D66=\"\",\"\",แนบท้ายรายงาน!H60)","v":""},""]
[null,null,null,{"$f":"IF(แนบท้ายรายงาน!B61=\"\",\"\",แนบท้ายรายงาน!B61)","v":""},{"$f":"IF(D67=\"\",\"\",แนบท้ายรายงาน!C61)","v":""},null,"",null,{"$f":"IF(แนบท้ายรายงาน!C61=\"\",\"\",แนบท้ายรายงาน!I61)","v":""},{"$f":"IF(แนบท้ายรายงาน!C61=\"\",\"\",\"บาท\")","v":""},"","",{"$f":"IF(D67=\"\",\"\",แนบท้ายรายงาน!D61)","v":""},{"$f":"IF(D67=\"\",\"\",แนบท้ายรายงาน!E61)","v":""},{"$f":"IF(D67=\"\",\"\",แนบท้ายรายงาน!H61)","v":""},""]
[null,null,null,{"$f":"IF(แนบท้ายรายงาน!B62=\"\",\"\",แนบท้ายรายงาน!B62)","v":""},{"$f":"IF(D68=\"\",\"\",แนบท้ายรายงาน!C62)","v":""},null,"",null,{"$f":"IF(แนบท้ายรายงาน!C62=\"\",\"\",แนบท้ายรายงาน!I62)","v":""},{"$f":"IF(แนบท้ายรายงาน!C62=\"\",\"\",\"บาท\")","v":""},"","",{"$f":"IF(D68=\"\",\"\",แนบท้ายรายงาน!D62)","v":""},{"$f":"IF(D68=\"\",\"\",แนบท้ายรายงาน!E62)","v":""},{"$f":"IF(D68=\"\",\"\",แนบท้ายรายงาน!H62)","v":""},""]
[null,null,null,{"$f":"IF(แนบท้ายรายงาน!B63=\"\",\"\",แนบท้ายรายงาน!B63)","v":""},{"$f":"IF(D69=\"\",\"\",แนบท้ายรายงาน!C63)","v":""},null,"",null,{"$f":"IF(แนบท้ายรายงาน!C63=\"\",\"\",แนบท้ายรายงาน!I63)","v":""},{"$f":"IF(แนบท้ายรายงาน!C63=\"\",\"\",\"บาท\")","v":""},"","",{"$f":"IF(D69=\"\",\"\",แนบท้ายรายงาน!D63)","v":""},{"$f":"IF(D69=\"\",\"\",แนบท้ายรายงาน!E63)","v":""},{"$f":"IF(D69=\"\",\"\",แนบท้ายรายงาน!H63)","v":""},""]
[null,null,null,{"$f":"IF(แนบท้ายรายงาน!B64=\"\",\"\",แนบท้ายรายงาน!B64)","v":""},{"$f":"IF(D70=\"\",\"\",แนบท้ายรายงาน!C64)","v":""},null,"",null,{"$f":"IF(แนบท้ายรายงาน!C64=\"\",\"\",แนบท้ายรายงาน!I64)","v":""},{"$f":"IF(แนบท้ายรายงาน!C64=\"\",\"\",\"บาท\")","v":""},"","",{"$f":"IF(D70=\"\",\"\",แนบท้ายรายงาน!D64)","v":""},{"$f":"IF(D70=\"\",\"\",แนบท้ายรายงาน!E64)","v":""},{"$f":"IF(D70=\"\",\"\",แนบท้ายรายงาน!H64)","v":""},""]
[null,null,null,{"$f":"IF(แนบท้ายรายงาน!B65=\"\",\"\",แนบท้ายรายงาน!B65)","v":""},{"$f":"IF(D71=\"\",\"\",แนบท้ายรายงาน!C65)","v":""},null,"",null,{"$f":"IF(แนบท้ายรายงาน!C65=\"\",\"\",แนบท้ายรายงาน!I65)","v":""},{"$f":"IF(แนบท้ายรายงาน!C65=\"\",\"\",\"บาท\")","v":""},"","",{"$f":"IF(D71=\"\",\"\",แนบท้ายรายงาน!D65)","v":""},{"$f":"IF(D71=\"\",\"\",แนบท้ายรายงาน!E65)","v":""},{"$f":"IF(D71=\"\",\"\",แนบท้ายรายงาน!H65)","v":""},""]
[null,null,null,{"$f":"IF(แนบท้ายรายงาน!B66=\"\",\"\",แนบท้ายรายงาน!B66)","v":""},{"$f":"IF(D72=\"\",\"\",แนบท้ายรายงาน!C66)","v":""},null,"",null,{"$f":"IF(แนบท้ายรายงาน!C66=\"\",\"\",แนบท้ายรายงาน!I66)","v":""},{"$f":"IF(แนบท้ายรายงาน!C66=\"\",\"\",\"บาท\")","v":""},"","",{"$f":"IF(D72=\"\",\"\",แนบท้ายรายงาน!D66)","v":""},{"$f":"IF(D72=\"\",\"\",แนบท้ายรายงาน!E66)","v":""},{"$f":"IF(D72=\"\",\"\",แนบท้ายรายงาน!H66)","v":""},""]
[null,null,null,{"$f":"IF(แนบท้ายรายงาน!B67=\"\",\"\",แนบท้ายรายงาน!B67)","v":""},{"$f":"IF(D73=\"\",\"\",แนบท้ายรายงาน!C67)","v":""},null,"",null,{"$f":"IF(แนบท้ายรายงาน!C67=\"\",\"\",แนบท้ายรายงาน!I67)","v":""},{"$f":"IF(แนบท้ายรายงาน!C67=\"\",\"\",\"บาท\")","v":""},"","",{"$f":"IF(D73=\"\",\"\",แนบท้ายรายงาน!D67)","v":""},{"$f":"IF(D73=\"\",\"\",แนบท้ายรายงาน!E67)","v":""},{"$f":"IF(D73=\"\",\"\",แนบท้ายรายงาน!H67)","v":""},""]
[null,null,null,{"$f":"IF(แนบท้ายรายงาน!B68=\"\",\"\",แนบท้ายรายงาน!B68)","v":""},{"$f":"IF(D74=\"\",\"\",แนบท้ายรายงาน!C68)","v":""},null,"",null,{"$f":"IF(แนบท้ายรายงาน!C68=\"\",\"\",แนบท้ายรายงาน!I68)","v":""},{"$f":"IF(แนบท้ายรายงาน!C68=\"\",\"\",\"บาท\")","v":""},"","",{"$f":"IF(D74=\"\",\"\",แนบท้ายรายงาน!D68)","v":""},{"$f":"IF(D74=\"\",\"\",แนบท้ายรายงาน!E68)","v":""},{"$f":"IF(D74=\"\",\"\",แนบท้ายรายงาน!H68)","v":""},""]
[null,null,null,{"$f":"IF(แนบท้ายรายงาน!B69=\"\",\"\",แนบท้ายรายงาน!B69)","v":""},{"$f":"IF(D75=\"\",\"\",แนบท้ายรายงาน!C69)","v":""},null,"",null,{"$f":"IF(แนบท้ายรายงาน!C69=\"\",\"\",แนบท้ายรายงาน!I69)","v":""},{"$f":"IF(แนบท้ายรายงาน!C69=\"\",\"\",\"บาท\")","v":""},"","",{"$f":"IF(D75=\"\",\"\",แนบท้ายรายงาน!D69)","v":""},{"$f":"IF(D75=\"\",\"\",แนบท้ายรายงาน!E69)","v":""},{"$f":"IF(D75=\"\",\"\",แนบท้ายรายงาน!H69)","v":""},""]
[null,null,null,{"$f":"IF(แนบท้ายรายงาน!B70=\"\",\"\",แนบท้ายรายงาน!B70)","v":""},{"$f":"IF(D76=\"\",\"\",แนบท้ายรายงาน!C70)","v":""},null,"",null,{"$f":"IF(แนบท้ายรายงาน!C70=\"\",\"\",แนบท้ายรายงาน!I70)","v":""},{"$f":"IF(แนบท้ายรายงาน!C70=\"\",\"\",\"บาท\")","v":""},"","",{"$f":"IF(D76=\"\",\"\",แนบท้ายรายงาน!D70)","v":""},{"$f":"IF(D76=\"\",\"\",แนบท้ายรายงาน!E70)","v":""},{"$f":"IF(D76=\"\",\"\",แนบท้ายรายงาน!H70)","v":""},""]
[null,null,null,{"$f":"IF(แนบท้ายรายงาน!B71=\"\",\"\",แนบท้ายรายงาน!B71)","v":""},{"$f":"IF(D77=\"\",\"\",แนบท้ายรายงาน!C71)","v":""},null,{"$f":"IF(D77=\"\",\"\",L77&\" \"&M77&\" \"&N77&\"ๆ ละไม่เกิน\"&\"   \"&O77&\" \"&P77&\" รวม\")","v":""},null,{"$f":"IF(แนบท้ายรายงาน!C71=\"\",\"\",แนบท้ายรายงาน!I71)","v":""},{"$f":"IF(แนบท้ายรายงาน!C71=\"\",\"\",\"บาท\")","v":""},{"$f":"IF(D77=\"\",\"\",\"เลือกปริ้น\")","v":""},"",{"$f":"IF(D77=\"\",\"\",แนบท้ายรายงาน!D71)","v":""},{"$f":"IF(D77=\"\",\"\",แนบท้ายรายงาน!E71)","v":""},{"$f":"IF(D77=\"\",\"\",แนบท้ายรายงาน!H71)","v":""},""]
[null,null,null,{"$f":"IF(แนบท้ายรายงาน!B72=\"\",\"\",แนบท้ายรายงาน!B72)","v":""},{"$f":"IF(D78=\"\",\"\",แนบท้ายรายงาน!C72)","v":""},null,"",null,{"$f":"IF(แนบท้ายรายงาน!C72=\"\",\"\",แนบท้ายรายงาน!I72)","v":""},{"$f":"IF(แนบท้ายรายงาน!C72=\"\",\"\",\"บาท\")","v":""},"","",{"$f":"IF(D78=\"\",\"\",แนบท้ายรายงาน!D72)","v":""},{"$f":"IF(D78=\"\",\"\",แนบท้ายรายงาน!E72)","v":""},{"$f":"IF(D78=\"\",\"\",แนบท้ายรายงาน!H72)","v":""},""]
[null,null,null,{"$f":"IF(แนบท้ายรายงาน!B73=\"\",\"\",แนบท้ายรายงาน!B73)","v":""},{"$f":"IF(D79=\"\",\"\",แนบท้ายรายงาน!C73)","v":""},null,"",null,{"$f":"IF(แนบท้ายรายงาน!C73=\"\",\"\",แนบท้ายรายงาน!I73)","v":""},{"$f":"IF(แนบท้ายรายงาน!C73=\"\",\"\",\"บาท\")","v":""},"","",{"$f":"IF(D79=\"\",\"\",แนบท้ายรายงาน!D73)","v":""},{"$f":"IF(D79=\"\",\"\",แนบท้ายรายงาน!E73)","v":""},{"$f":"IF(D79=\"\",\"\",แนบท้ายรายงาน!H73)","v":""},""]
[null,null,null,{"$f":"IF(แนบท้ายรายงาน!B74=\"\",\"\",แนบท้ายรายงาน!B74)","v":""},{"$f":"IF(D80=\"\",\"\",แนบท้ายรายงาน!C74)","v":""},null,"",null,{"$f":"IF(แนบท้ายรายงาน!C74=\"\",\"\",แนบท้ายรายงาน!I74)","v":""},{"$f":"IF(แนบท้ายรายงาน!C74=\"\",\"\",\"บาท\")","v":""},"","",{"$f":"IF(D80=\"\",\"\",แนบท้ายรายงาน!D74)","v":""},{"$f":"IF(D80=\"\",\"\",แนบท้ายรายงาน!E74)","v":""},{"$f":"IF(D80=\"\",\"\",แนบท้ายรายงาน!H74)","v":""},""]
[null,null,null,{"$f":"IF(แนบท้ายรายงาน!B75=\"\",\"\",แนบท้ายรายงาน!B75)","v":""},{"$f":"IF(D81=\"\",\"\",แนบท้ายรายงาน!C75)","v":""},null,"",null,{"$f":"IF(แนบท้ายรายงาน!C75=\"\",\"\",แนบท้ายรายงาน!I75)","v":""},{"$f":"IF(แนบท้ายรายงาน!C75=\"\",\"\",\"บาท\")","v":""},"","",{"$f":"IF(D81=\"\",\"\",แนบท้ายรายงาน!D75)","v":""},{"$f":"IF(D81=\"\",\"\",แนบท้ายรายงาน!E75)","v":""},{"$f":"IF(D81=\"\",\"\",แนบท้ายรายงาน!H75)","v":""},""]
[null,null,null,{"$f":"IF(แนบท้ายรายงาน!B76=\"\",\"\",แนบท้ายรายงาน!B76)","v":""},{"$f":"IF(D82=\"\",\"\",แนบท้ายรายงาน!C76)","v":""},null,"",null,{"$f":"IF(แนบท้ายรายงาน!C76=\"\",\"\",แนบท้ายรายงาน!I76)","v":""},{"$f":"IF(แนบท้ายรายงาน!C76=\"\",\"\",\"บาท\")","v":""},"","",{"$f":"IF(D82=\"\",\"\",แนบท้ายรายงาน!D76)","v":""},{"$f":"IF(D82=\"\",\"\",แนบท้ายรายงาน!E76)","v":""},{"$f":"IF(D82=\"\",\"\",แนบท้ายรายงาน!H76)","v":""},""]
[null,null,null,{"$f":"IF(แนบท้ายรายงาน!B77=\"\",\"\",แนบท้ายรายงาน!B77)","v":""},{"$f":"IF(D83=\"\",\"\",แนบท้ายรายงาน!C77)","v":""},null,"",null,{"$f":"IF(แนบท้ายรายงาน!C77=\"\",\"\",แนบท้ายรายงาน!I77)","v":""},{"$f":"IF(แนบท้ายรายงาน!C77=\"\",\"\",\"บาท\")","v":""},"","",{"$f":"IF(D83=\"\",\"\",แนบท้ายรายงาน!D77)","v":""},{"$f":"IF(D83=\"\",\"\",แนบท้ายรายงาน!E77)","v":""},{"$f":"IF(D83=\"\",\"\",แนบท้ายรายงาน!H77)","v":""},""]
[null,null,null,{"$f":"IF(แนบท้ายรายงาน!B78=\"\",\"\",แนบท้ายรายงาน!B78)","v":""},{"$f":"IF(D84=\"\",\"\",แนบท้ายรายงาน!C78)","v":""},null,"",null,{"$f":"IF(แนบท้ายรายงาน!C78=\"\",\"\",แนบท้ายรายงาน!I78)","v":""},{"$f":"IF(แนบท้ายรายงาน!C78=\"\",\"\",\"บาท\")","v":""},"","",{"$f":"IF(D84=\"\",\"\",แนบท้ายรายงาน!D78)","v":""},{"$f":"IF(D84=\"\",\"\",แนบท้ายรายงาน!E78)","v":""},{"$f":"IF(D84=\"\",\"\",แนบท้ายรายงาน!H78)","v":""},""]
[null,null,null,{"$f":"IF(แนบท้ายรายงาน!B79=\"\",\"\",แนบท้ายรายงาน!B79)","v":""},{"$f":"IF(D85=\"\",\"\",แนบท้ายรายงาน!C79)","v":""},null,"",null,{"$f":"IF(แนบท้ายรายงาน!C79=\"\",\"\",แนบท้ายรายงาน!I79)","v":""},{"$f":"IF(แนบท้ายรายงาน!C79=\"\",\"\",\"บาท\")","v":""},"","",{"$f":"IF(D85=\"\",\"\",แนบท้ายรายงาน!D79)","v":""},{"$f":"IF(D85=\"\",\"\",แนบท้ายรายงาน!E79)","v":""},{"$f":"IF(D85=\"\",\"\",แนบท้ายรายงาน!H79)","v":""},""]
[null,null,null,null,"รวมวงเงินไม่เกิน",{"$f":"SUM(I12:I85)","v":6390},{"$f":"BAHTTEXT(F86)","v":"หกพันสามร้อยเก้าสิบบาทถ้วน"},null,null,null,"เลือกปริ้น",null,null,null,{"$f":"SUM(O12:O85)","v":2130}]
[null,null,null,null,"ข้อเสนอ",null,null,null,null,null,"เลือกปริ้น"]
[null,null,null,null,"จึงเรียนมาเพื่อโปรดทราบ และพิจารณาอนุมัติ",null,null,null,null,null,"เลือกปริ้น"]
[null,null,null,null,null,null,"     (ลงชื่อ)................................................................",null,null,null,"เลือกปริ้น"]
[null,null,null,null,null,null,null,{"$f":"DATABASE!D13","v":"นายดำรงค์  สีระสูงเนิน"},null,null,"เลือกปริ้น"]
[null,"เรียน  ",{"$f":"C6","v":"สาธารณสุขอำเภอหนองหงส์"},null,null,null,null,{"$f":"DATABASE!D14","v":"ผู้อำนวยการโรงพยาบาลส่งเสริมสุขภาพตำบลบ้านกระเบื้องน้อย"},null,null,"เลือกปริ้น"]
[null,null,null," - เพื่อโปรดทราบ/พิจารณาอนุมัติ",null,null,null,"o อนุมัติ    o ไม่อนุมัติ",null,null,"เลือกปริ้น"]
[null,null,null,null,null,null,null,"                         เนื่องจาก..................................",null,null,"เลือกปริ้น"]
[null,null,null,null,null,null,null,null,null,null,"เลือกปริ้น"]
[null,null,null,null,{"$f":"DATABASE!C7","v":"นางจุรีพร  บัวลอย"},null,null,{"$f":"DATABASE!C6","v":"นายประหยัด  นงประโคน"},null,null,"เลือกปริ้น"]
[null,null,null,null,{"$f":"DATABASE!D7","v":"นักวิชาการสาธารณสุข ชำนาญการ"},null,null,{"$f":"DATABASE!D6","v":"สาธารณสุขอำเภอหนองหงส์"},null,null,"เลือกปริ้น"]

{"sheet":"ใบเสนอราคา","index":3,"n_rows":91,"n_cols":9,"rows_kept":91,"cut":false,"hidden":false,"merged":[[7,2,7,6],[85,1,85,5],[88,3,88,5],[89,3,89,5],[90,3,90,5],[8,1,8,6],[10,3,10,4],[0,1,0,6],[1,1,1,6],[2,1,2,6],[3,1,3,6],[4,3,4,5]]}
[null,"ใบเสนอราคา"]
[null,{"$f":"DATABASE!C19","v":"หจก. ธงชัย โอเอ เซลส์แอนเซอร์วิส"}]
[null,{"$f":"DATABASE!C20","v":"68/4-5, 70 ถ.ธานี ต.ในเมือง อ.เมือง จ.บุรีรัมย์"}]
[null,{"$f":"DATABASE!D20","v":"โทรศัพท์ 0 4461 2189"}]
[null,null,"วันที่",{"$f":"เห็นชอบ!H4+2","v":"2562-03-17"},null,null,null,"รายละเอียดให้ไปบันทึกใน Sheet แนบท้ายรายงาน"]
[null,"เรื่อง  ","เสนอราคาพัสดุ"]
[null,"เรียน  ",{"$f":"DATABASE!B11","v":"เจ้าหน้าที่"}]
[null,null,{"$f":"DATABASE!C19&\" \"&DATABASE!C20&\" \"&DATABASE!D20","v":"หจก. ธงชัย โอเอ เซลส์แอนเซอร์วิส 68/4-5, 70 ถ.ธานี ต.ในเมือง อ.เมือง จ.บุรีรัมย์ โทรศัพท์ 0 4461 2189"},null,null,null,null,null,"&\" \"&DATABASE!B22"]
[null,{"$f":"DATABASE!B21&\" \"&DATABASE!C21&\"   \"&\"ข้าพเจ้าเป็นผู้มีคุณสมบัติครบถ้วนตามที่กำหนดและไม่เป็นผู้ทิ้งงานของทางราชการ ขอเสนอพัสดุ \"","v":"เลขผู้เสียภาษี 313539001261   ข้าพเจ้าเป็นผู้มีคุณสมบัติครบถ้วนตามที่กำหนดและไม่เป็นผู้ทิ้งงานของทางราชการ ขอเสนอพัสดุ "}]
[null,"รวมทั้งบริการและกำหนดเวลาส่งมอบ ดังต่อไปนี้"]
[null,"ที่","รายการ","จำนวนหน่วย",null,"ราคาต่อหน่วย","รวมเงิน",null,"<< เลือกตัวกรองก่อนปริ้นทุกครั้ง"]
[null,{"$f":"IF(แนบท้ายรายงาน!B6=\"\",\"\",แนบท้ายรายงาน!B6)","v":1},"DDR 4 PC 4GB/2400 Kindmax",{"$f":"IF(แนบท้ายรายงาน!D6=\"\",\"\",แนบท้ายรายงาน!D6)","v":3},{"$f":"IF(แนบท้ายรายงาน!E6=\"\",\"\",แนบท้ายรายงาน!E6)","v":"ตัว"},{"$f":"แนบท้ายรายงาน!H6","v":2130},{"$f":"แนบท้ายรายงาน!I6","v":6390},{"$f":"IF(C12=\"\",\"\",\"เลือกปริ้น\")","v":"เลือกปริ้น"}]
[null,{"$f":"IF(แนบท้ายรายงาน!B7=\"\",\"\",แนบท้ายรายงาน!B7)","v":""},{"$f":"IF(แนบท้ายรายงาน!C7=\"\",\"\",แนบท้ายรายงาน!C7)","v":""},{"$f":"IF(แนบท้ายรายงาน!D7=\"\",\"\",แนบท้ายรายงาน!D7)","v":""},{"$f":"IF(แนบท้ายรายงาน!E7=\"\",\"\",แนบท้ายรายงาน!E7)","v":""},{"$f":"แนบท้ายรายงาน!H7","v":0},{"$f":"แนบท้ายรายงาน!I7","v":""},{"$f":"IF(C13=\"\",\"\",\"เลือกปริ้น\")","v":""}]
[null,{"$f":"IF(แนบท้ายรายงาน!B8=\"\",\"\",แนบท้ายรายงาน!B8)","v":""},{"$f":"IF(แนบท้ายรายงาน!C8=\"\",\"\",แนบท้ายรายงาน!C8)","v":""},{"$f":"IF(แนบท้ายรายงาน!D8=\"\",\"\",แนบท้ายรายงาน!D8)","v":""},{"$f":"IF(แนบท้ายรายงาน!E8=\"\",\"\",แนบท้ายรายงาน!E8)","v":""},{"$f":"แนบท้ายรายงาน!H8","v":0},{"$f":"แนบท้ายรายงาน!I8","v":""},""]
[null,{"$f":"IF(แนบท้ายรายงาน!B9=\"\",\"\",แนบท้ายรายงาน!B9)","v":""},{"$f":"IF(แนบท้ายรายงาน!C9=\"\",\"\",แนบท้ายรายงาน!C9)","v":""},{"$f":"IF(แนบท้ายรายงาน!D9=\"\",\"\",แนบท้ายรายงาน!D9)","v":""},{"$f":"IF(แนบท้ายรายงาน!E9=\"\",\"\",แนบท้ายรายงาน!E9)","v":""},{"$f":"แนบท้ายรายงาน!H9","v":0},{"$f":"แนบท้ายรายงาน!I9","v":""},""]
[null,{"$f":"IF(แนบท้ายรายงาน!B10=\"\",\"\",แนบท้ายรายงาน!B10)","v":""},{"$f":"IF(แนบท้ายรายงาน!C10=\"\",\"\",แนบท้ายรายงาน!C10)","v":""},{"$f":"IF(แนบท้ายรายงาน!D10=\"\",\"\",แนบท้ายรายงาน!D10)","v":""},{"$f":"IF(แนบท้ายรายงาน!E10=\"\",\"\",แนบท้ายรายงาน!E10)","v":""},{"$f":"แนบท้ายรายงาน!H10","v":0},{"$f":"แนบท้ายรายงาน!I10","v":""},""]
[null,{"$f":"IF(แนบท้ายรายงาน!B11=\"\",\"\",แนบท้ายรายงาน!B11)","v":""},{"$f":"IF(แนบท้ายรายงาน!C11=\"\",\"\",แนบท้ายรายงาน!C11)","v":""},{"$f":"IF(แนบท้ายรายงาน!D11=\"\",\"\",แนบท้ายรายงาน!D11)","v":""},{"$f":"IF(แนบท้ายรายงาน!E11=\"\",\"\",แนบท้ายรายงาน!E11)","v":""},{"$f":"แนบท้ายรายงาน!H11","v":0},{"$f":"แนบท้ายรายงาน!I11","v":""},""]
[null,{"$f":"IF(แนบท้ายรายงาน!B12=\"\",\"\",แนบท้ายรายงาน!B12)","v":""},{"$f":"IF(แนบท้ายรายงาน!C12=\"\",\"\",แนบท้ายรายงาน!C12)","v":""},{"$f":"IF(แนบท้ายรายงาน!D12=\"\",\"\",แนบท้ายรายงาน!D12)","v":""},{"$f":"IF(แนบท้ายรายงาน!E12=\"\",\"\",แนบท้ายรายงาน!E12)","v":""},{"$f":"แนบท้ายรายงาน!H12","v":0},{"$f":"แนบท้ายรายงาน!I12","v":""},""]
[null,{"$f":"IF(แนบท้ายรายงาน!B13=\"\",\"\",แนบท้ายรายงาน!B13)","v":""},{"$f":"IF(แนบท้ายรายงาน!C13=\"\",\"\",แนบท้ายรายงาน!C13)","v":""},{"$f":"IF(แนบท้ายรายงาน!D13=\"\",\"\",แนบท้ายรายงาน!D13)","v":""},{"$f":"IF(แนบท้ายรายงาน!E13=\"\",\"\",แนบท้ายรายงาน!E13)","v":""},{"$f":"แนบท้ายรายงาน!H13","v":""},{"$f":"แนบท้ายรายงาน!I13","v":""},""]
[null,{"$f":"IF(แนบท้ายรายงาน!B14=\"\",\"\",แนบท้ายรายงาน!B14)","v":""},{"$f":"IF(แนบท้ายรายงาน!C14=\"\",\"\",แนบท้ายรายงาน!C14)","v":""},{"$f":"IF(แนบท้ายรายงาน!D14=\"\",\"\",แนบท้ายรายงาน!D14)","v":""},{"$f":"IF(แนบท้ายรายงาน!E14=\"\",\"\",แนบท้ายรายงาน!E14)","v":""},{"$f":"แนบท้ายรายงาน!H14","v":""},{"$f":"แนบท้ายรายงาน!I14","v":""},""]
[null,{"$f":"IF(แนบท้ายรายงาน!B15=\"\",\"\",แนบท้ายรายงาน!B15)","v":""},{"$f":"IF(แนบท้ายรายงาน!C15=\"\",\"\",แนบท้ายรายงาน!C15)","v":""},{"$f":"IF(แนบท้ายรายงาน!D15=\"\",\"\",แนบท้ายรายงาน!D15)","v":""},{"$f":"IF(แนบท้ายรายงาน!E15=\"\",\"\",แนบท้ายรายงาน!E15)","v":""},{"$f":"แนบท้ายรายงาน!H15","v":""},{"$f":"แนบท้ายรายงาน!I15","v":""},""]
[null,{"$f":"IF(แนบท้ายรายงาน!B16=\"\",\"\",แนบท้ายรายงาน!B16)","v":""},{"$f":"IF(แนบท้ายรายงาน!C16=\"\",\"\",แนบท้ายรายงาน!C16)","v":""},{"$f":"IF(แนบท้ายรายงาน!D16=\"\",\"\",แนบท้ายรายงาน!D16)","v":""},{"$f":"IF(แนบท้ายรายงาน!E16=\"\",\"\",แนบท้ายรายงาน!E16)","v":""},{"$f":"แนบท้ายรายงาน!H16","v":""},{"$f":"แนบท้ายรายงาน!I16","v":""},""]
[null,{"$f":"IF(แนบท้ายรายงาน!B17=\"\",\"\",แนบท้ายรายงาน!B17)","v":""},{"$f":"IF(แนบท้ายรายงาน!C17=\"\",\"\",แนบท้ายรายงาน!C17)","v":""},{"$f":"IF(แนบท้ายรายงาน!D17=\"\",\"\",แนบท้ายรายงาน!D17)","v":""},{"$f":"IF(แนบท้ายรายงาน!E17=\"\",\"\",แนบท้ายรายงาน!E17)","v":""},{"$f":"แนบท้ายรายงาน!H17","v":""},{"$f":"แนบท้ายรายงาน!I17","v":""},""]
[null,{"$f":"IF(แนบท้ายรายงาน!B18=\"\",\"\",แนบท้ายรายงาน!B18)","v":""},{"$f":"IF(แนบท้ายรายงาน!C18=\"\",\"\",แนบท้ายรายงาน!C18)","v":""},{"$f":"IF(แนบท้ายรายงาน!D18=\"\",\"\",แนบท้ายรายงาน!D18)","v":""},{"$f":"IF(แนบท้ายรายงาน!E18=\"\",\"\",แนบท้ายรายงาน!E18)","v":""},{"$f":"แนบท้ายรายงาน!H18","v":""},{"$f":"แนบท้ายรายงาน!I18","v":""},""]
[null,{"$f":"IF(แนบท้ายรายงาน!B19=\"\",\"\",แนบท้ายรายงาน!B19)","v":""},{"$f":"IF(แนบท้ายรายงาน!C19=\"\",\"\",แนบท้ายรายงาน!C19)","v":""},{"$f":"IF(แนบท้ายรายงาน!D19=\"\",\"\",แนบท้ายรายงาน!D19)","v":""},{"$f":"IF(แนบท้ายรายงาน!E19=\"\",\"\",แนบท้ายรายงาน!E19)","v":""},{"$f":"แนบท้ายรายงาน!H19","v":""},{"$f":"แนบท้ายรายงาน!I19","v":""},""]
[null,{"$f":"IF(แนบท้ายรายงาน!B20=\"\",\"\",แนบท้ายรายงาน!B20)","v":""},{"$f":"IF(แนบท้ายรายงาน!C20=\"\",\"\",แนบท้ายรายงาน!C20)","v":""},{"$f":"IF(แนบท้ายรายงาน!D20=\"\",\"\",แนบท้ายรายงาน!D20)","v":""},{"$f":"IF(แนบท้ายรายงาน!E20=\"\",\"\",แนบท้ายรายงาน!E20)","v":""},{"$f":"แนบท้ายรายงาน!H20","v":""},{"$f":"แนบท้ายรายงาน!I20","v":""},""]
[null,{"$f":"IF(แนบท้ายรายงาน!B21=\"\",\"\",แนบท้ายรายงาน!B21)","v":""},{"$f":"IF(แนบท้ายรายงาน!C21=\"\",\"\",แนบท้ายรายงาน!C21)","v":""},{"$f":"IF(แนบท้ายรายงาน!D21=\"\",\"\",แนบท้ายรายงาน!D21)","v":""},{"$f":"IF(แนบท้ายรายงาน!E21=\"\",\"\",แนบท้ายรายงาน!E21)","v":""},{"$f":"แนบท้ายรายงาน!H21","v":""},{"$f":"แนบท้ายรายงาน!I21","v":""},""]
[null,{"$f":"IF(แนบท้ายรายงาน!B22=\"\",\"\",แนบท้ายรายงาน!B22)","v":""},{"$f":"IF(แนบท้ายรายงาน!C22=\"\",\"\",แนบท้ายรายงาน!C22)","v":""},{"$f":"IF(แนบท้ายรายงาน!D22=\"\",\"\",แนบท้ายรายงาน!D22)","v":""},{"$f":"IF(แนบท้ายรายงาน!E22=\"\",\"\",แนบท้ายรายงาน!E22)","v":""},{"$f":"แนบท้ายรายงาน!H22","v":""},{"$f":"แนบท้ายรายงาน!I22","v":""},""]
[null,{"$f":"IF(แนบท้ายรายงาน!B23=\"\",\"\",แนบท้ายรายงาน!B23)","v":""},{"$f":"IF(แนบท้ายรายงาน!C23=\"\",\"\",แนบท้ายรายงาน!C23)","v":""},{"$f":"IF(แนบท้ายรายงาน!D23=\"\",\"\",แนบท้ายรายงาน!D23)","v":""},{"$f":"IF(แนบท้ายรายงาน!E23=\"\",\"\",แนบท้ายรายงาน!E23)","v":""},{"$f":"แนบท้ายรายงาน!H23","v":""},{"$f":"แนบท้ายรายงาน!I23","v":""},""]
[null,{"$f":"IF(แนบท้ายรายงาน!B24=\"\",\"\",แนบท้ายรายงาน!B24)","v":""},{"$f":"IF(แนบท้ายรายงาน!C24=\"\",\"\",แนบท้ายรายงาน!C24)","v":""},{"$f":"IF(แนบท้ายรายงาน!D24=\"\",\"\",แนบท้ายรายงาน!D24)","v":""},{"$f":"IF(แนบท้ายรายงาน!E24=\"\",\"\",แนบท้ายรายงาน!E24)","v":""},{"$f":"แนบท้ายรายงาน!H24","v":""},{"$f":"แนบท้ายรายงาน!I24","v":""},""]
[null,{"$f":"IF(แนบท้ายรายงาน!B25=\"\",\"\",แนบท้ายรายงาน!B25)","v":""},{"$f":"IF(แนบท้ายรายงาน!C25=\"\",\"\",แนบท้ายรายงาน!C25)","v":""},{"$f":"IF(แนบท้ายรายงาน!D25=\"\",\"\",แนบท้ายรายงาน!D25)","v":""},{"$f":"IF(แนบท้ายรายงาน!E25=\"\",\"\",แนบท้ายรายงาน!E25)","v":""},{"$f":"แนบท้ายรายงาน!H25","v":""},{"$f":"แนบท้ายรายงาน!I25","v":""},""]
[null,{"$f":"IF(แนบท้ายรายงาน!B26=\"\",\"\",แนบท้ายรายงาน!B26)","v":""},{"$f":"IF(แนบท้ายรายงาน!C26=\"\",\"\",แนบท้ายรายงาน!C26)","v":""},{"$f":"IF(แนบท้ายรายงาน!D26=\"\",\"\",แนบท้ายรายงาน!D26)","v":""},{"$f":"IF(แนบท้ายรายงาน!E26=\"\",\"\",แนบท้ายรายงาน!E26)","v":""},{"$f":"แนบท้ายรายงาน!H26","v":""},{"$f":"แนบท้ายรายงาน!I26","v":""},""]
[null,{"$f":"IF(แนบท้ายรายงาน!B27=\"\",\"\",แนบท้ายรายงาน!B27)","v":""},{"$f":"IF(แนบท้ายรายงาน!C27=\"\",\"\",แนบท้ายรายงาน!C27)","v":""},{"$f":"IF(แนบท้ายรายงาน!D27=\"\",\"\",แนบท้ายรายงาน!D27)","v":""},{"$f":"IF(แนบท้ายรายงาน!E27=\"\",\"\",แนบท้ายรายงาน!E27)","v":""},{"$f":"แนบท้ายรายงาน!H27","v":""},{"$f":"แนบท้ายรายงาน!I27","v":""},""]
[null,{"$f":"IF(แนบท้ายรายงาน!B28=\"\",\"\",แนบท้ายรายงาน!B28)","v":""},{"$f":"IF(แนบท้ายรายงาน!C28=\"\",\"\",แนบท้ายรายงาน!C28)","v":""},{"$f":"IF(แนบท้ายรายงาน!D28=\"\",\"\",แนบท้ายรายงาน!D28)","v":""},{"$f":"IF(แนบท้ายรายงาน!E28=\"\",\"\",แนบท้ายรายงาน!E28)","v":""},{"$f":"แนบท้ายรายงาน!H28","v":""},{"$f":"แนบท้ายรายงาน!I28","v":""},""]
[null,{"$f":"IF(แนบท้ายรายงาน!B29=\"\",\"\",แนบท้ายรายงาน!B29)","v":""},{"$f":"IF(แนบท้ายรายงาน!C29=\"\",\"\",แนบท้ายรายงาน!C29)","v":""},{"$f":"IF(แนบท้ายรายงาน!D29=\"\",\"\",แนบท้ายรายงาน!D29)","v":""},{"$f":"IF(แนบท้ายรายงาน!E29=\"\",\"\",แนบท้ายรายงาน!E29)","v":""},{"$f":"แนบท้ายรายงาน!H29","v":""},{"$f":"แนบท้ายรายงาน!I29","v":""},""]
[null,{"$f":"IF(แนบท้ายรายงาน!B30=\"\",\"\",แนบท้ายรายงาน!B30)","v":""},{"$f":"IF(แนบท้ายรายงาน!C30=\"\",\"\",แนบท้ายรายงาน!C30)","v":""},{"$f":"IF(แนบท้ายรายงาน!D30=\"\",\"\",แนบท้ายรายงาน!D30)","v":""},{"$f":"IF(แนบท้ายรายงาน!E30=\"\",\"\",แนบท้ายรายงาน!E30)","v":""},{"$f":"แนบท้ายรายงาน!H30","v":""},{"$f":"แนบท้ายรายงาน!I30","v":""},""]
[null,{"$f":"IF(แนบท้ายรายงาน!B31=\"\",\"\",แนบท้ายรายงาน!B31)","v":""},{"$f":"IF(แนบท้ายรายงาน!C31=\"\",\"\",แนบท้ายรายงาน!C31)","v":""},{"$f":"IF(แนบท้ายรายงาน!D31=\"\",\"\",แนบท้ายรายงาน!D31)","v":""},{"$f":"IF(แนบท้ายรายงาน!E31=\"\",\"\",แนบท้ายรายงาน!E31)","v":""},{"$f":"แนบท้ายรายงาน!H31","v":""},{"$f":"แนบท้ายรายงาน!I31","v":""},""]
[null,{"$f":"IF(แนบท้ายรายงาน!B32=\"\",\"\",แนบท้ายรายงาน!B32)","v":""},{"$f":"IF(แนบท้ายรายงาน!C32=\"\",\"\",แนบท้ายรายงาน!C32)","v":""},{"$f":"IF(แนบท้ายรายงาน!D32=\"\",\"\",แนบท้ายรายงาน!D32)","v":""},{"$f":"IF(แนบท้ายรายงาน!E32=\"\",\"\",แนบท้ายรายงาน!E32)","v":""},{"$f":"แนบท้ายรายงาน!H32","v":""},{"$f":"แนบท้ายรายงาน!I32","v":""},""]
[null,{"$f":"IF(แนบท้ายรายงาน!B33=\"\",\"\",แนบท้ายรายงาน!B33)","v":""},{"$f":"IF(แนบท้ายรายงาน!C33=\"\",\"\",แนบท้ายรายงาน!C33)","v":""},{"$f":"IF(แนบท้ายรายงาน!D33=\"\",\"\",แนบท้ายรายงาน!D33)","v":""},{"$f":"IF(แนบท้ายรายงาน!E33=\"\",\"\",แนบท้ายรายงาน!E33)","v":""},{"$f":"แนบท้ายรายงาน!H33","v":""},{"$f":"แนบท้ายรายงาน!I33","v":""},""]
[null,{"$f":"IF(แนบท้ายรายงาน!B34=\"\",\"\",แนบท้ายรายงาน!B34)","v":""},{"$f":"IF(แนบท้ายรายงาน!C34=\"\",\"\",แนบท้ายรายงาน!C34)","v":""},{"$f":"IF(แนบท้ายรายงาน!D34=\"\",\"\",แนบท้ายรายงาน!D34)","v":""},{"$f":"IF(แนบท้ายรายงาน!E34=\"\",\"\",แนบท้ายรายงาน!E34)","v":""},{"$f":"แนบท้ายรายงาน!H34","v":""},{"$f":"แนบท้ายรายงาน!I34","v":""},""]
[null,{"$f":"IF(แนบท้ายรายงาน!B35=\"\",\"\",แนบท้ายรายงาน!B35)","v":""},{"$f":"IF(แนบท้ายรายงาน!C35=\"\",\"\",แนบท้ายรายงาน!C35)","v":""},{"$f":"IF(แนบท้ายรายงาน!D35=\"\",\"\",แนบท้ายรายงาน!D35)","v":""},{"$f":"IF(แนบท้ายรายงาน!E35=\"\",\"\",แนบท้ายรายงาน!E35)","v":""},{"$f":"แนบท้ายรายงาน!H35","v":""},{"$f":"แนบท้ายรายงาน!I35","v":""},""]
[null,{"$f":"IF(แนบท้ายรายงาน!B36=\"\",\"\",แนบท้ายรายงาน!B36)","v":""},{"$f":"IF(แนบท้ายรายงาน!C36=\"\",\"\",แนบท้ายรายงาน!C36)","v":""},{"$f":"IF(แนบท้ายรายงาน!D36=\"\",\"\",แนบท้ายรายงาน!D36)","v":""},{"$f":"IF(แนบท้ายรายงาน!E36=\"\",\"\",แนบท้ายรายงาน!E36)","v":""},{"$f":"แนบท้ายรายงาน!H36","v":""},{"$f":"แนบท้ายรายงาน!I36","v":""},""]
[null,{"$f":"IF(แนบท้ายรายงาน!B37=\"\",\"\",แนบท้ายรายงาน!B37)","v":""},{"$f":"IF(แนบท้ายรายงาน!C37=\"\",\"\",แนบท้ายรายงาน!C37)","v":""},{"$f":"IF(แนบท้ายรายงาน!D37=\"\",\"\",แนบท้ายรายงาน!D37)","v":""},{"$f":"IF(แนบท้ายรายงาน!E37=\"\",\"\",แนบท้ายรายงาน!E37)","v":""},{"$f":"แนบท้ายรายงาน!H37","v":""},{"$f":"แนบท้ายรายงาน!I37","v":""},""]
[null,{"$f":"IF(แนบท้ายรายงาน!B38=\"\",\"\",แนบท้ายรายงาน!B38)","v":""},{"$f":"IF(แนบท้ายรายงาน!C38=\"\",\"\",แนบท้ายรายงาน!C38)","v":""},{"$f":"IF(แนบท้ายรายงาน!D38=\"\",\"\",แนบท้ายรายงาน!D38)","v":""},{"$f":"IF(แนบท้ายรายงาน!E38=\"\",\"\",แนบท้ายรายงาน!E38)","v":""},{"$f":"แนบท้ายรายงาน!H38","v":""},{"$f":"แนบท้ายรายงาน!I38","v":""},""]
[null,{"$f":"IF(แนบท้ายรายงาน!B39=\"\",\"\",แนบท้ายรายงาน!B39)","v":""},{"$f":"IF(แนบท้ายรายงาน!C39=\"\",\"\",แนบท้ายรายงาน!C39)","v":""},{"$f":"IF(แนบท้ายรายงาน!D39=\"\",\"\",แนบท้ายรายงาน!D39)","v":""},{"$f":"IF(แนบท้ายรายงาน!E39=\"\",\"\",แนบท้ายรายงาน!E39)","v":""},{"$f":"แนบท้ายรายงาน!H39","v":""},{"$f":"แนบท้ายรายงาน!I39","v":""},""]
[null,{"$f":"IF(แนบท้ายรายงาน!B40=\"\",\"\",แนบท้ายรายงาน!B40)","v":""},{"$f":"IF(แนบท้ายรายงาน!C40=\"\",\"\",แนบท้ายรายงาน!C40)","v":""},{"$f":"IF(แนบท้ายรายงาน!D40=\"\",\"\",แนบท้ายรายงาน!D40)","v":""},{"$f":"IF(แนบท้ายรายงาน!E40=\"\",\"\",แนบท้ายรายงาน!E40)","v":""},{"$f":"แนบท้ายรายงาน!H40","v":""},{"$f":"แนบท้ายรายงาน!I40","v":""},""]
[null,{"$f":"IF(แนบท้ายรายงาน!B41=\"\",\"\",แนบท้ายรายงาน!B41)","v":""},{"$f":"IF(แนบท้ายรายงาน!C41=\"\",\"\",แนบท้ายรายงาน!C41)","v":""},{"$f":"IF(แนบท้ายรายงาน!D41=\"\",\"\",แนบท้ายรายงาน!D41)","v":""},{"$f":"IF(แนบท้ายรายงาน!E41=\"\",\"\",แนบท้ายรายงาน!E41)","v":""},{"$f":"แนบท้ายรายงาน!H41","v":""},{"$f":"แนบท้ายรายงาน!I41","v":""},""]
[null,{"$f":"IF(แนบท้ายรายงาน!B42=\"\",\"\",แนบท้ายรายงาน!B42)","v":""},{"$f":"IF(แนบท้ายรายงาน!C42=\"\",\"\",แนบท้ายรายงาน!C42)","v":""},{"$f":"IF(แนบท้ายรายงาน!D42=\"\",\"\",แนบท้ายรายงาน!D42)","v":""},{"$f":"IF(แนบท้ายรายงาน!E42=\"\",\"\",แนบท้ายรายงาน!E42)","v":""},{"$f":"แนบท้ายรายงาน!H42","v":""},{"$f":"แนบท้ายรายงาน!I42","v":""},""]
[null,{"$f":"IF(แนบท้ายรายงาน!B43=\"\",\"\",แนบท้ายรายงาน!B43)","v":""},{"$f":"IF(แนบท้ายรายงาน!C43=\"\",\"\",แนบท้ายรายงาน!C43)","v":""},{"$f":"IF(แนบท้ายรายงาน!D43=\"\",\"\",แนบท้ายรายงาน!D43)","v":""},{"$f":"IF(แนบท้ายรายงาน!E43=\"\",\"\",แนบท้ายรายงาน!E43)","v":""},{"$f":"แนบท้ายรายงาน!H43","v":""},{"$f":"แนบท้ายรายงาน!I43","v":""},""]
[null,{"$f":"IF(แนบท้ายรายงาน!B44=\"\",\"\",แนบท้ายรายงาน!B44)","v":""},{"$f":"IF(แนบท้ายรายงาน!C44=\"\",\"\",แนบท้ายรายงาน!C44)","v":""},{"$f":"IF(แนบท้ายรายงาน!D44=\"\",\"\",แนบท้ายรายงาน!D44)","v":""},{"$f":"IF(แนบท้ายรายงาน!E44=\"\",\"\",แนบท้ายรายงาน!E44)","v":""},{"$f":"แนบท้ายรายงาน!H44","v":""},{"$f":"แนบท้ายรายงาน!I44","v":""},""]
[null,{"$f":"IF(แนบท้ายรายงาน!B45=\"\",\"\",แนบท้ายรายงาน!B45)","v":""},{"$f":"IF(แนบท้ายรายงาน!C45=\"\",\"\",แนบท้ายรายงาน!C45)","v":""},{"$f":"IF(แนบท้ายรายงาน!D45=\"\",\"\",แนบท้ายรายงาน!D45)","v":""},{"$f":"IF(แนบท้ายรายงาน!E45=\"\",\"\",แนบท้ายรายงาน!E45)","v":""},{"$f":"แนบท้ายรายงาน!H45","v":""},{"$f":"แนบท้ายรายงาน!I45","v":""},""]
[null,{"$f":"IF(แนบท้ายรายงาน!B46=\"\",\"\",แนบท้ายรายงาน!B46)","v":""},{"$f":"IF(แนบท้ายรายงาน!C46=\"\",\"\",แนบท้ายรายงาน!C46)","v":""},{"$f":"IF(แนบท้ายรายงาน!D46=\"\",\"\",แนบท้ายรายงาน!D46)","v":""},{"$f":"IF(แนบท้ายรายงาน!E46=\"\",\"\",แนบท้ายรายงาน!E46)","v":""},{"$f":"แนบท้ายรายงาน!H46","v":""},{"$f":"แนบท้ายรายงาน!I46","v":""},""]
[null,{"$f":"IF(แนบท้ายรายงาน!B47=\"\",\"\",แนบท้ายรายงาน!B47)","v":""},{"$f":"IF(แนบท้ายรายงาน!C47=\"\",\"\",แนบท้ายรายงาน!C47)","v":""},{"$f":"IF(แนบท้ายรายงาน!D47=\"\",\"\",แนบท้ายรายงาน!D47)","v":""},{"$f":"IF(แนบท้ายรายงาน!E47=\"\",\"\",แนบท้ายรายงาน!E47)","v":""},{"$f":"แนบท้ายรายงาน!H47","v":""},{"$f":"แนบท้ายรายงาน!I47","v":""},""]
[null,{"$f":"IF(แนบท้ายรายงาน!B48=\"\",\"\",แนบท้ายรายงาน!B48)","v":""},{"$f":"IF(แนบท้ายรายงาน!C48=\"\",\"\",แนบท้ายรายงาน!C48)","v":""},{"$f":"IF(แนบท้ายรายงาน!D48=\"\",\"\",แนบท้ายรายงาน!D48)","v":""},{"$f":"IF(แนบท้ายรายงาน!E48=\"\",\"\",แนบท้ายรายงาน!E48)","v":""},{"$f":"แนบท้ายรายงาน!H48","v":""},{"$f":"แนบท้ายรายงาน!I48","v":""},""]
[null,{"$f":"IF(แนบท้ายรายงาน!B49=\"\",\"\",แนบท้ายรายงาน!B49)","v":""},{"$f":"IF(แนบท้ายรายงาน!C49=\"\",\"\",แนบท้ายรายงาน!C49)","v":""},{"$f":"IF(แนบท้ายรายงาน!D49=\"\",\"\",แนบท้ายรายงาน!D49)","v":""},{"$f":"IF(แนบท้ายรายงาน!E49=\"\",\"\",แนบท้ายรายงาน!E49)","v":""},{"$f":"แนบท้ายรายงาน!H49","v":""},{"$f":"แนบท้ายรายงาน!I49","v":""},""]
[null,{"$f":"IF(แนบท้ายรายงาน!B50=\"\",\"\",แนบท้ายรายงาน!B50)","v":""},{"$f":"IF(แนบท้ายรายงาน!C50=\"\",\"\",แนบท้ายรายงาน!C50)","v":""},{"$f":"IF(แนบท้ายรายงาน!D50=\"\",\"\",แนบท้ายรายงาน!D50)","v":""},{"$f":"IF(แนบท้ายรายงาน!E50=\"\",\"\",แนบท้ายรายงาน!E50)","v":""},{"$f":"แนบท้ายรายงาน!H50","v":""},{"$f":"แนบท้ายรายงาน!I50","v":""},""]
[null,{"$f":"IF(แนบท้ายรายงาน!B51=\"\",\"\",แนบท้ายรายงาน!B51)","v":""},{"$f":"IF(แนบท้ายรายงาน!C51=\"\",\"\",แนบท้ายรายงาน!C51)","v":""},{"$f":"IF(แนบท้ายรายงาน!D51=\"\",\"\",แนบท้ายรายงาน!D51)","v":""},{"$f":"IF(แนบท้ายรายงาน!E51=\"\",\"\",แนบท้ายรายงาน!E51)","v":""},{"$f":"แนบท้ายรายงาน!H51","v":""},{"$f":"แนบท้ายรายงาน!I51","v":""},""]
[null,{"$f":"IF(แนบท้ายรายงาน!B52=\"\",\"\",แนบท้ายรายงาน!B52)","v":""},{"$f":"IF(แนบท้ายรายงาน!C52=\"\",\"\",แนบท้ายรายงาน!C52)","v":""},{"$f":"IF(แนบท้ายรายงาน!D52=\"\",\"\",แนบท้ายรายงาน!D52)","v":""},{"$f":"IF(แนบท้ายรายงาน!E52=\"\",\"\",แนบท้ายรายงาน!E52)","v":""},{"$f":"แนบท้ายรายงาน!H52","v":""},{"$f":"แนบท้ายรายงาน!I52","v":""},""]
[null,{"$f":"IF(แนบท้ายรายงาน!B53=\"\",\"\",แนบท้ายรายงาน!B53)","v":""},{"$f":"IF(แนบท้ายรายงาน!C53=\"\",\"\",แนบท้ายรายงาน!C53)","v":""},{"$f":"IF(แนบท้ายรายงาน!D53=\"\",\"\",แนบท้ายรายงาน!D53)","v":""},{"$f":"IF(แนบท้ายรายงาน!E53=\"\",\"\",แนบท้ายรายงาน!E53)","v":""},{"$f":"แนบท้ายรายงาน!H53","v":""},{"$f":"แนบท้ายรายงาน!I53","v":""},""]
[null,{"$f":"IF(แนบท้ายรายงาน!B54=\"\",\"\",แนบท้ายรายงาน!B54)","v":""},{"$f":"IF(แนบท้ายรายงาน!C54=\"\",\"\",แนบท้ายรายงาน!C54)","v":""},{"$f":"IF(แนบท้ายรายงาน!D54=\"\",\"\",แนบท้ายรายงาน!D54)","v":""},{"$f":"IF(แนบท้ายรายงาน!E54=\"\",\"\",แนบท้ายรายงาน!E54)","v":""},{"$f":"แนบท้ายรายงาน!H54","v":""},{"$f":"แนบท้ายรายงาน!I54","v":""},""]
[null,{"$f":"IF(แนบท้ายรายงาน!B55=\"\",\"\",แนบท้ายรายงาน!B55)","v":""},{"$f":"IF(แนบท้ายรายงาน!C55=\"\",\"\",แนบท้ายรายงาน!C55)","v":""},{"$f":"IF(แนบท้ายรายงาน!D55=\"\",\"\",แนบท้ายรายงาน!D55)","v":""},{"$f":"IF(แนบท้ายรายงาน!E55=\"\",\"\",แนบท้ายรายงาน!E55)","v":""},{"$f":"แนบท้ายรายงาน!H55","v":""},{"$f":"แนบท้ายรายงาน!I55","v":""},""]
[null,{"$f":"IF(แนบท้ายรายงาน!B56=\"\",\"\",แนบท้ายรายงาน!B56)","v":""},{"$f":"IF(แนบท้ายรายงาน!C56=\"\",\"\",แนบท้ายรายงาน!C56)","v":""},{"$f":"IF(แนบท้ายรายงาน!D56=\"\",\"\",แนบท้ายรายงาน!D56)","v":""},{"$f":"IF(แนบท้ายรายงาน!E56=\"\",\"\",แนบท้ายรายงาน!E56)","v":""},{"$f":"แนบท้ายรายงาน!H56","v":""},{"$f":"แนบท้ายรายงาน!I56","v":""},""]
[null,{"$f":"IF(แนบท้ายรายงาน!B57=\"\",\"\",แนบท้ายรายงาน!B57)","v":""},{"$f":"IF(แนบท้ายรายงาน!C57=\"\",\"\",แนบท้ายรายงาน!C57)","v":""},{"$f":"IF(แนบท้ายรายงาน!D57=\"\",\"\",แนบท้ายรายงาน!D57)","v":""},{"$f":"IF(แนบท้ายรายงาน!E57=\"\",\"\",แนบท้ายรายงาน!E57)","v":""},{"$f":"แนบท้ายรายงาน!H57","v":""},{"$f":"แนบท้ายรายงาน!I57","v":""},""]
[null,{"$f":"IF(แนบท้ายรายงาน!B58=\"\",\"\",แนบท้ายรายงาน!B58)","v":""},{"$f":"IF(แนบท้ายรายงาน!C58=\"\",\"\",แนบท้ายรายงาน!C58)","v":""},{"$f":"IF(แนบท้ายรายงาน!D58=\"\",\"\",แนบท้ายรายงาน!D58)","v":""},{"$f":"IF(แนบท้ายรายงาน!E58=\"\",\"\",แนบท้ายรายงาน!E58)","v":""},{"$f":"แนบท้ายรายงาน!H58","v":""},{"$f":"แนบท้ายรายงาน!I58","v":""},""]
[null,{"$f":"IF(แนบท้ายรายงาน!B59=\"\",\"\",แนบท้ายรายงาน!B59)","v":""},{"$f":"IF(แนบท้ายรายงาน!C59=\"\",\"\",แนบท้ายรายงาน!C59)","v":""},{"$f":"IF(แนบท้ายรายงาน!D59=\"\",\"\",แนบท้ายรายงาน!D59)","v":""},{"$f":"IF(แนบท้ายรายงาน!E59=\"\",\"\",แนบท้ายรายงาน!E59)","v":""},{"$f":"แนบท้ายรายงาน!H59","v":""},{"$f":"แนบท้ายรายงาน!I59","v":""},""]
[null,{"$f":"IF(แนบท้ายรายงาน!B60=\"\",\"\",แนบท้ายรายงาน!B60)","v":""},{"$f":"IF(แนบท้ายรายงาน!C60=\"\",\"\",แนบท้ายรายงาน!C60)","v":""},{"$f":"IF(แนบท้ายรายงาน!D60=\"\",\"\",แนบท้ายรายงาน!D60)","v":""},{"$f":"IF(แนบท้ายรายงาน!E60=\"\",\"\",แนบท้ายรายงาน!E60)","v":""},{"$f":"แนบท้ายรายงาน!H60","v":""},{"$f":"แนบท้ายรายงาน!I60","v":""},""]
[null,{"$f":"IF(แนบท้ายรายงาน!B61=\"\",\"\",แนบท้ายรายงาน!B61)","v":""},{"$f":"IF(แนบท้ายรายงาน!C61=\"\",\"\",แนบท้ายรายงาน!C61)","v":""},{"$f":"IF(แนบท้ายรายงาน!D61=\"\",\"\",แนบท้ายรายงาน!D61)","v":""},{"$f":"IF(แนบท้ายรายงาน!E61=\"\",\"\",แนบท้ายรายงาน!E61)","v":""},{"$f":"แนบท้ายรายงาน!H61","v":""},{"$f":"แนบท้ายรายงาน!I61","v":""},""]
[null,{"$f":"IF(แนบท้ายรายงาน!B62=\"\",\"\",แนบท้ายรายงาน!B62)","v":""},{"$f":"IF(แนบท้ายรายงาน!C62=\"\",\"\",แนบท้ายรายงาน!C62)","v":""},{"$f":"IF(แนบท้ายรายงาน!D62=\"\",\"\",แนบท้ายรายงาน!D62)","v":""},{"$f":"IF(แนบท้ายรายงาน!E62=\"\",\"\",แนบท้ายรายงาน!E62)","v":""},{"$f":"แนบท้ายรายงาน!H62","v":""},{"$f":"แนบท้ายรายงาน!I62","v":""},""]
[null,{"$f":"IF(แนบท้ายรายงาน!B63=\"\",\"\",แนบท้ายรายงาน!B63)","v":""},{"$f":"IF(แนบท้ายรายงาน!C63=\"\",\"\",แนบท้ายรายงาน!C63)","v":""},{"$f":"IF(แนบท้ายรายงาน!D63=\"\",\"\",แนบท้ายรายงาน!D63)","v":""},{"$f":"IF(แนบท้ายรายงาน!E63=\"\",\"\",แนบท้ายรายงาน!E63)","v":""},{"$f":"แนบท้ายรายงาน!H63","v":""},{"$f":"แนบท้ายรายงาน!I63","v":""},""]
[null,{"$f":"IF(แนบท้ายรายงาน!B64=\"\",\"\",แนบท้ายรายงาน!B64)","v":""},{"$f":"IF(แนบท้ายรายงาน!C64=\"\",\"\",แนบท้ายรายงาน!C64)","v":""},{"$f":"IF(แนบท้ายรายงาน!D64=\"\",\"\",แนบท้ายรายงาน!D64)","v":""},{"$f":"IF(แนบท้ายรายงาน!E64=\"\",\"\",แนบท้ายรายงาน!E64)","v":""},{"$f":"แนบท้ายรายงาน!H64","v":""},{"$f":"แนบท้ายรายงาน!I64","v":""},""]
[null,{"$f":"IF(แนบท้ายรายงาน!B65=\"\",\"\",แนบท้ายรายงาน!B65)","v":""},{"$f":"IF(แนบท้ายรายงาน!C65=\"\",\"\",แนบท้ายรายงาน!C65)","v":""},{"$f":"IF(แนบท้ายรายงาน!D65=\"\",\"\",แนบท้ายรายงาน!D65)","v":""},{"$f":"IF(แนบท้ายรายงาน!E65=\"\",\"\",แนบท้ายรายงาน!E65)","v":""},{"$f":"แนบท้ายรายงาน!H65","v":""},{"$f":"แนบท้ายรายงาน!I65","v":""},""]
[null,{"$f":"IF(แนบท้ายรายงาน!B66=\"\",\"\",แนบท้ายรายงาน!B66)","v":""},{"$f":"IF(แนบท้ายรายงาน!C66=\"\",\"\",แนบท้ายรายงาน!C66)","v":""},{"$f":"IF(แนบท้ายรายงาน!D66=\"\",\"\",แนบท้ายรายงาน!D66)","v":""},{"$f":"IF(แนบท้ายรายงาน!E66=\"\",\"\",แนบท้ายรายงาน!E66)","v":""},{"$f":"แนบท้ายรายงาน!H66","v":""},{"$f":"แนบท้ายรายงาน!I66","v":""},""]
[null,{"$f":"IF(แนบท้ายรายงาน!B67=\"\",\"\",แนบท้ายรายงาน!B67)","v":""},{"$f":"IF(แนบท้ายรายงาน!C67=\"\",\"\",แนบท้ายรายงาน!C67)","v":""},{"$f":"IF(แนบท้ายรายงาน!D67=\"\",\"\",แนบท้ายรายงาน!D67)","v":""},{"$f":"IF(แนบท้ายรายงาน!E67=\"\",\"\",แนบท้ายรายงาน!E67)","v":""},{"$f":"แนบท้ายรายงาน!H67","v":""},{"$f":"แนบท้ายรายงาน!I67","v":""},""]
[null,{"$f":"IF(แนบท้ายรายงาน!B68=\"\",\"\",แนบท้ายรายงาน!B68)","v":""},{"$f":"IF(แนบท้ายรายงาน!C68=\"\",\"\",แนบท้ายรายงาน!C68)","v":""},{"$f":"IF(แนบท้ายรายงาน!D68=\"\",\"\",แนบท้ายรายงาน!D68)","v":""},{"$f":"IF(แนบท้ายรายงาน!E68=\"\",\"\",แนบท้ายรายงาน!E68)","v":""},{"$f":"แนบท้ายรายงาน!H68","v":""},{"$f":"แนบท้ายรายงาน!I68","v":""},""]
[null,{"$f":"IF(แนบท้ายรายงาน!B69=\"\",\"\",แนบท้ายรายงาน!B69)","v":""},{"$f":"IF(แนบท้ายรายงาน!C69=\"\",\"\",แนบท้ายรายงาน!C69)","v":""},{"$f":"IF(แนบท้ายรายงาน!D69=\"\",\"\",แนบท้ายรายงาน!D69)","v":""},{"$f":"IF(แนบท้ายรายงาน!E69=\"\",\"\",แนบท้ายรายงาน!E69)","v":""},{"$f":"แนบท้ายรายงาน!H69","v":""},{"$f":"แนบท้ายรายงาน!I69","v":""},""]
[null,{"$f":"IF(แนบท้ายรายงาน!B70=\"\",\"\",แนบท้ายรายงาน!B70)","v":""},{"$f":"IF(แนบท้ายรายงาน!C70=\"\",\"\",แนบท้ายรายงาน!C70)","v":""},{"$f":"IF(แนบท้ายรายงาน!D70=\"\",\"\",แนบท้ายรายงาน!D70)","v":""},{"$f":"IF(แนบท้ายรายงาน!E70=\"\",\"\",แนบท้ายรายงาน!E70)","v":""},{"$f":"แนบท้ายรายงาน!H70","v":""},{"$f":"แนบท้ายรายงาน!I70","v":""},""]
[null,{"$f":"IF(แนบท้ายรายงาน!B71=\"\",\"\",แนบท้ายรายงาน!B71)","v":""},{"$f":"IF(แนบท้ายรายงาน!C71=\"\",\"\",แนบท้ายรายงาน!C71)","v":""},{"$f":"IF(แนบท้ายรายงาน!D71=\"\",\"\",แนบท้ายรายงาน!D71)","v":""},{"$f":"IF(แนบท้ายรายงาน!E71=\"\",\"\",แนบท้ายรายงาน!E71)","v":""},{"$f":"แนบท้ายรายงาน!H71","v":""},{"$f":"แนบท้ายรายงาน!I71","v":""},{"$f":"IF(C77=\"\",\"\",\"เลือกปริ้น\")","v":""}]
[null,{"$f":"IF(แนบท้ายรายงาน!B72=\"\",\"\",แนบท้ายรายงาน!B72)","v":""},{"$f":"IF(แนบท้ายรายงาน!C72=\"\",\"\",แนบท้ายรายงาน!C72)","v":""},{"$f":"IF(แนบท้ายรายงาน!D72=\"\",\"\",แนบท้ายรายงาน!D72)","v":""},{"$f":"IF(แนบท้ายรายงาน!E72=\"\",\"\",แนบท้ายรายงาน!E72)","v":""},{"$f":"แนบท้ายรายงาน!H72","v":""},{"$f":"แนบท้ายรายงาน!I72","v":""},""]
[null,{"$f":"IF(แนบท้ายรายงาน!B73=\"\",\"\",แนบท้ายรายงาน!B73)","v":""},{"$f":"IF(แนบท้ายรายงาน!C73=\"\",\"\",แนบท้ายรายงาน!C73)","v":""},{"$f":"IF(แนบท้ายรายงาน!D73=\"\",\"\",แนบท้ายรายงาน!D73)","v":""},{"$f":"IF(แนบท้ายรายงาน!E73=\"\",\"\",แนบท้ายรายงาน!E73)","v":""},{"$f":"แนบท้ายรายงาน!H73","v":""},{"$f":"แนบท้ายรายงาน!I73","v":""},""]
[null,{"$f":"IF(แนบท้ายรายงาน!B74=\"\",\"\",แนบท้ายรายงาน!B74)","v":""},{"$f":"IF(แนบท้ายรายงาน!C74=\"\",\"\",แนบท้ายรายงาน!C74)","v":""},{"$f":"IF(แนบท้ายรายงาน!D74=\"\",\"\",แนบท้ายรายงาน!D74)","v":""},{"$f":"IF(แนบท้ายรายงาน!E74=\"\",\"\",แนบท้ายรายงาน!E74)","v":""},{"$f":"แนบท้ายรายงาน!H74","v":""},{"$f":"แนบท้ายรายงาน!I74","v":""},""]
[null,{"$f":"IF(แนบท้ายรายงาน!B75=\"\",\"\",แนบท้ายรายงาน!B75)","v":""},{"$f":"IF(แนบท้ายรายงาน!C75=\"\",\"\",แนบท้ายรายงาน!C75)","v":""},{"$f":"IF(แนบท้ายรายงาน!D75=\"\",\"\",แนบท้ายรายงาน!D75)","v":""},{"$f":"IF(แนบท้ายรายงาน!E75=\"\",\"\",แนบท้ายรายงาน!E75)","v":""},{"$f":"แนบท้ายรายงาน!H75","v":""},{"$f":"แนบท้ายรายงาน!I75","v":""},""]
[null,{"$f":"IF(แนบท้ายรายงาน!B76=\"\",\"\",แนบท้ายรายงาน!B76)","v":""},{"$f":"IF(แนบท้ายรายงาน!C76=\"\",\"\",แนบท้ายรายงาน!C76)","v":""},{"$f":"IF(แนบท้ายรายงาน!D76=\"\",\"\",แนบท้ายรายงาน!D76)","v":""},{"$f":"IF(แนบท้ายรายงาน!E76=\"\",\"\",แนบท้ายรายงาน!E76)","v":""},{"$f":"แนบท้ายรายงาน!H76","v":""},{"$f":"แนบท้ายรายงาน!I76","v":""},""]
[null,{"$f":"IF(แนบท้ายรายงาน!B77=\"\",\"\",แนบท้ายรายงาน!B77)","v":""},{"$f":"IF(แนบท้ายรายงาน!C77=\"\",\"\",แนบท้ายรายงาน!C77)","v":""},{"$f":"IF(แนบท้ายรายงาน!D77=\"\",\"\",แนบท้ายรายงาน!D77)","v":""},{"$f":"IF(แนบท้ายรายงาน!E77=\"\",\"\",แนบท้ายรายงาน!E77)","v":""},{"$f":"แนบท้ายรายงาน!H77","v":""},{"$f":"แนบท้ายรายงาน!I77","v":""},""]
[null,{"$f":"IF(แนบท้ายรายงาน!B78=\"\",\"\",แนบท้ายรายงาน!B78)","v":""},{"$f":"IF(แนบท้ายรายงาน!C78=\"\",\"\",แนบท้ายรายงาน!C78)","v":""},{"$f":"IF(แนบท้ายรายงาน!D78=\"\",\"\",แนบท้ายรายงาน!D78)","v":""},{"$f":"IF(แนบท้ายรายงาน!E78=\"\",\"\",แนบท้ายรายงาน!E78)","v":""},{"$f":"แนบท้ายรายงาน!H78","v":""},{"$f":"แนบท้ายรายงาน!I78","v":""},""]
[null,{"$f":"IF(แนบท้ายรายงาน!B79=\"\",\"\",แนบท้ายรายงาน!B79)","v":""},{"$f":"IF(แนบท้ายรายงาน!C79=\"\",\"\",แนบท้ายรายงาน!C79)","v":""},{"$f":"IF(แนบท้ายรายงาน!D79=\"\",\"\",แนบท้ายรายงาน!D79)","v":""},{"$f":"IF(แนบท้ายรายงาน!E79=\"\",\"\",แนบท้ายรายงาน!E79)","v":""},{"$f":"แนบท้ายรายงาน!H79","v":""},{"$f":"แนบท้ายรายงาน!I79","v":""},""]
[null,"รวมเป็นเงินทั้งสิ้น",null,null,null,null,{"$f":"SUM(G12:G85)","v":6390},"เลือกปริ้น"]
[null,"ตัวอักษร",{"$f":"\"(\"&BAHTTEXT(G86)&\")\"","v":"(หกพันสามร้อยเก้าสิบบาทถ้วน)"},null,null,null,null,"เลือกปริ้น"]
[null,null,"ซึ่งเป็นราคาที่รวมภาษีมูลค่าเพิ่ม รวมทั้งภาษีอากรอื่น และค่าใช้จ่ายทั้งปวงไว้ด้วยแล้ว",null,null,null,null,"เลือกปริ้น"]
[null,null,null,"ขอแสดงความนับถือ",null,null,null,"เลือกปริ้น"]
[null,null,null,{"$f":"DATABASE!D19","v":".........................................................."},null,null,null,"เลือกปริ้น"]
[null,null,null,"ผู้เสนอราคา",null,null,null,"เลือกปริ้น"]

{"sheet":"รายงานจัดซื้อ","index":4,"n_rows":35,"n_cols":15,"rows_kept":35,"cut":false,"hidden":false,"merged":[[25,1,25,11],[0,1,0,11],[14,8,14,11],[11,5,11,11],[1,3,1,11],[4,2,4,9],[9,1,9,11],[2,2,2,3],[2,7,2,11],[20,4,20,5],[21,4,21,5],[22,4,22,5],[33,7,33,11],[32,3,32,5],[33,1,33,6],[27,8,27,9],[28,3,28,5],[28,7,28,10],[32,7,32,11]]}
[null,"บันทึกข้อความ"]
[null,"ส่วนราชการ",null,{"$f":"DATABASE!C4&\" \"&DATABASE!D4","v":"สำนักงานสาธารณสุขอำเภอหนองหงส์ อำเภอหนองหงส์  จังหวัดบุรีรัมย์ 31240 "}]
[null,"ที่",{"$f":"DATABASE!C3","v":"บร 1332.1/"},null,318,null,"วันที่","2562-03-15"]
[null,"เรื่อง",{"$f":"เห็นชอบ!C5","v":"ซื้อวัสดุคอมพิวเตอร์ (RAM)"}]
[null,"เรียน",{"$f":"\"ผู้ว่าราชการจังหวัดบุรีรัมย์ (โดย\"&DATABASE!D6&\"ปฏิบัติราชการแทน)\"","v":"ผู้ว่าราชการจังหวัดบุรีรัมย์ (โดยสาธารณสุขอำเภอหนองหงส์ปฏิบัติราชการแทน)"}]
[null,null,null,"ด้วย",{"$f":"DATABASE!C15","v":"โรงพยาบาลส่งเสริมสุขภาพตำบลบ้านกระเบื้องน้อย"},null,null,"จะดำเนินการขอซื้อพัสดุ จำนวน",null,null,{"$f":"COUNT(แนบท้ายรายงาน!$H$6:$H$79)","v":1},"รายการ"]
[null,"โดยวิธีเฉพาะเจาะจง เพื่อใช้ในงานราชการ ตามหนังสือที่",null,null,null,null,{"$f":"เห็นชอบ!C4&เห็นชอบ!E4&\" ลงวันที่ \"","v":"บร 1332.1.4/55 ลงวันที่ "},null,null,{"$f":"เห็นชอบ!H4","v":"2562-03-15"},"ดังต่อไปนี้"]
[null,null,1,"เหตุผลและความจำเป็นที่ต้องซื้อ คือ"]
[null,null,null,{"$f":"เห็นชอบ!C5","v":"ซื้อวัสดุคอมพิวเตอร์ (RAM)"}]
[null,{"$f":"DATABASE!C15&\" \"&DATABASE!D15&\"รายละเอียดตามหนังสือ\"","v":"โรงพยาบาลส่งเสริมสุขภาพตำบลบ้านกระเบื้องน้อย อำเภอหนองหงส์ จังหวัดบุรีรัมย์รายละเอียดตามหนังสือ"}]
[null,{"$f":"เห็นชอบ!B4&\" \"&เห็นชอบ!C4&เห็นชอบ!E4&\" ลงวันที่\"&เห็นชอบ!N1&\"/\"&เห็นชอบ!O1&\"/\"&เห็นชอบ!P1","v":"ที่ บร 1332.1.4/55 ลงวันที่15/3/2562"}]
[null,null,2,"รายละเอียดของพัสดุ คือ",null,"(รายละเอียดตามบันทึกที่แนบ)",null,null,null,null,null,null,"เลือก",1,"ราคามาตรฐาน"]
[null,null,3,"ราคากลางและรายละเอียดของราคากลาง ",null,null,{"$f":"IF(M13=1,แนบท้ายรายงาน!G4,IF(รายงานจัดซื้อ!M13=2,แนบท้ายรายงาน!G5))","v":"ราคาที่ได้จากการสืบจากท้องตลาด"},null,null,null,null,null,2,2,"ราคาที่ได้จากการสืบจากท้องตลาด"]
[null,null,4,"วงเงินที่จะขอซื้อ โดยขอเบิกเงินบำรุงของหน่วยงาน สังกัด",null,null,null,{"$f":"DATABASE!C15","v":"โรงพยาบาลส่งเสริมสุขภาพตำบลบ้านกระเบื้องน้อย"}]
[null,"รหัสงบประมาณ........................................................",null,null,null,"จำนวน",{"$f":"แนบท้ายรายงาน!I82","v":6390},"บาท",{"$f":"\"(\"&BAHTTEXT(G15)&\")\"","v":"(หกพันสามร้อยเก้าสิบบาทถ้วน)"},null,null,null,"กำหนดส่งมอบ…วัน"]
[null,null,5,"กำหนดเวลาที่ต้องการใช้พัสดุ      ภายใน",null,null,{"$f":"M16","v":5},"วันทำการ นับถัดจากวันลงนามในสัญญา",null,null,null,null,5]
[null,null,6,"ดำเนินการซื้อ    โดยวิธีเฉพาะเจาะจง เนื่องจาก การจัดจ้างพัสดุที่มีการผลิต จำหน่าย ก่อสร้าง หรือให้บริการ"]
[null,"ทั่วไป และมีวงเงินในการจัดซื้อจัดจ้างครั้งหนึ่งไม่เกินวงเงินตามที่กำหนดในกฎกระทรวง"]
[null,null,7,"หลักเกณฑ์การพิจารณาคัดเลือกข้อเสนอ ",null,null,"โดยใช้เกณฑ์ราคา"]
[null,null,8,"การแต่งตั้งคณะกรรมการ    ",null," เห็นควรแต่งตั้งผู้ตรวจรับพัสดุ ตามเสนอ",null,null,null,null,null,null,"เลือก คณะกรรมการ"]
[null,null,null,{"$f":"IF(DATABASE!C17=\"\",\"\",1)","v":""},{"$f":"DATABASE!C16","v":"นางสุรินทร์  สีระสูงเนิน"},null,{"$f":"DATABASE!D16","v":"พยาบาลวิชาชีพ ชำนาญการ"},null,null,null,{"$f":"IF(DATABASE!C17=\"\",DATABASE!B16,\"ประธานกรรมการ\")","v":"ผู้ตรวจรับพัสดุ"},null,"เลือกปริ้น"]
[null,null,null,{"$f":"IF(DATABASE!C17=\"\",\"\",2)","v":""},{"$f":"IF(DATABASE!C17=\"\",\"\",DATABASE!C17)","v":""},null,{"$f":"IF(DATABASE!C17=\"\",\"\",DATABASE!D17)","v":""},null,null,null,{"$f":"IF(DATABASE!C17=\"\",\"\",\"กรรมการ\")","v":""},null,{"$f":"IF(DATABASE!C17=\"\",\"\",\"เลือกปริ้น\")","v":""}]
[null,null,null,{"$f":"IF(DATABASE!C18=\"\",\"\",3)","v":""},{"$f":"IF(DATABASE!C18=\"\",\"\",DATABASE!C18)","v":""},null,{"$f":"IF(DATABASE!C18=\"\",\"\",DATABASE!D18)","v":""},null,null,null,{"$f":"IF(DATABASE!C18=\"\",\"\",\"กรรมการ\")","v":""},null,{"$f":"IF(DATABASE!C18=\"\",\"\",\"เลือกปริ้น\")","v":""}]
[null,null,null,"จึงเรียนมาเพื่อโปรดพิจารณา หากเห็นชอบขอได้โปรด"]
[null,null,1,"เห็นชอบอนุมัติให้ดำเนินการ",null,{"$f":"เห็นชอบ!C5","v":"ซื้อวัสดุคอมพิวเตอร์ (RAM)"}]
[null,{"$f":"\"จาก \"&DATABASE!C19&\" ที่อยู่ \"&DATABASE!C20&\" เป็นจำนวนเงินทั้งสิ้น \"&G15&\" บาท\"","v":"จาก หจก. ธงชัย โอเอ เซลส์แอนเซอร์วิส ที่อยู่ 68/4-5, 70 ถ.ธานี ต.ในเมือง อ.เมือง จ.บุรีรัมย์ เป็นจำนวนเงินทั้งสิ้น 6390 บาท"}]
[null,null,2,"ลงนามในคำสั่งแต่งตั้งผู้ตรวจรับพัสดุ โดยวิธีเฉพาะเจาะจง "]
[null,null,"ลงชื่อ","…………………………………………………………",null,null,"เจ้าหน้าที่","ลงชื่อ","…………………………………………..",null,"หัวหน้าเจ้าหน้าที่"]
[null,null,null,{"$f":"DATABASE!C11","v":"นางวรรณเพ็ญ  วศินไพบูลย์วงศ์"},null,null,null,{"$f":"DATABASE!C7","v":"นางจุรีพร  บัวลอย"}]
[null,"เรียน",{"$f":"C5","v":"ผู้ว่าราชการจังหวัดบุรีรัมย์ (โดยสาธารณสุขอำเภอหนองหงส์ปฏิบัติราชการแทน)"}]
[null,null,null," - โปรดพิจารณาเห็นชอบ/ลงนาม",null,null,null,null,"o","เห็นชอบ / ลงนาม"]
[]
[null,null,null,"นายชัยณรงค์  สมสะอาด",null,null,null,{"$f":"DATABASE!C6","v":"นายประหยัด  นงประโคน"}]
[null,{"$f":"DATABASE!D7","v":"นักวิชาการสาธารณสุข ชำนาญการ"},null,null,null,null,null,{"$f":"DATABASE!D6","v":"สาธารณสุขอำเภอหนองหงส์"}]
[null,null,null,null,null,null,null,null,null,"ปฏิบัติราชการแทนผู้ว่าราชการจังหวัดบุรีรัมย์"]

{"sheet":"แนบท้ายรายงาน","index":5,"n_rows":82,"n_cols":12,"rows_kept":82,"cut":false,"hidden":false,"merged":[[0,9,0,11],[1,1,1,3],[3,3,3,4],[3,7,3,8],[3,1,4,1],[3,2,4,2],[2,1,2,8],[0,1,0,5],[0,7,0,8],[4,3,4,4]]}
[null,{"$f":"รายงานจัดซื้อ!B3&\" \"&รายงานจัดซื้อ!C3&\" \"&รายงานจัดซื้อ!E3","v":"ที่ บร 1332.1/ 318"},null,null,null,null,"ลงวันที่",{"$f":"IF(รายงานจัดซื้อ!H3=\"\",\"\",รายงานจัดซื้อ!H3)","v":"2562-03-15"},null,"รวม VAT ใส่เลข 1 ไม่รวมใส่เลข 0"]
[null,"งานจัดซื้อพัสดุ จำนวน",null,null,{"$f":"IF(รายงานจัดซื้อ!K6=\"\",\"\",รายงานจัดซื้อ!K6)","v":1},{"$f":"รายงานจัดซื้อ!L6","v":"รายการ"},null,null,null,1,"<<< บันทึกเลข 1 หรือ 0"]
[null,{"$f":"DATABASE!C15","v":"โรงพยาบาลส่งเสริมสุขภาพตำบลบ้านกระเบื้องน้อย"}]
[null,"ลำดับที่","รายละเอียดของพัสดุที่จะซื้อ","ความต้องการ",null,"o","ราคามาตรฐาน","จำนวนและวงเงินที่ขอซื้อครั้งนี้",null,null,{"$f":"I82","v":6390},"รวมเงินทั้งหมด"]
[null,null,null,"จำนวน\n",null,"þ","ราคาที่ได้จากการสืบจากท้องตลาด","หน่วยละ\n(บาท)","จำนวนเงิน\n(บาท)",null,"<< เลือกตัวกรองก่อนปริ้นทุกครั้ง"]
[null,{"$f":"IF(D6=\"\",\"\",1)","v":1},"RAM DDR 4 PC 4GB/2400",3,"ตัว",null,2130,{"$f":"IF(G6=\"\",\"\",G6)","v":2130},{"$f":"IF(D6=\"\",\"\",ROUNDDOWN(H6*D6,0))","v":6390},{"$f":"IF(C6=\"\",\"\",\"เลือกปริ้น\")","v":"เลือกปริ้น"},{"$f":"(H6*7%)+H6","v":2279.1},{"$f":"D6*K6","v":6837.2999999999993}]
[null,null,null,null,null,null,null,null,{"$f":"IF(D7=\"\",\"\",ROUNDDOWN(H7*D7,0))","v":""},{"$f":"IF(C7=\"\",\"\",\"เลือกปริ้น\")","v":""},{"$f":"(H7*7%)+H7","v":0},{"$f":"D7*K7","v":0}]
[null,null,null,null,null,null,null,null,"","",0,0]
[null,null,null,null,null,null,null,null,"","",0,0]
[null,null,null,null,null,null,null,null,"","",0,0]
[null,null,null,null,null,null,null,null,"","",0,0]
[null,null,null,null,null,null,null,null,"","",0,0]
[null,{"$f":"IF(D13=\"\",\"\",B12+1)","v":""},null,null,null,null,null,{"$f":"IF(G13=\"\",\"\",G13)","v":""},"","",{"$error":"#VALUE!"},{"$error":"#VALUE!"}]
[null,"",null,null,null,null,null,"","","",{"$error":"#VALUE!"},{"$error":"#VALUE!"}]
[null,"",null,null,null,null,null,"","","",{"$error":"#VALUE!"},{"$error":"#VALUE!"}]
[null,"",null,null,null,null,null,"","","",{"$error":"#VALUE!"},{"$error":"#VALUE!"}]
[null,"",null,null,null,null,null,"","","",{"$error":"#VALUE!"},{"$error":"#VALUE!"}]
[null,"",null,null,null,null,null,"","","",{"$error":"#VALUE!"},{"$error":"#VALUE!"}]
[null,"",null,null,null,null,null,"","","",{"$error":"#VALUE!"},{"$error":"#VALUE!"}]
[null,"",null,null,null,null,null,"","","",{"$error":"#VALUE!"},{"$error":"#VALUE!"}]
[null,"",null,null,null,null,null,"","","",{"$error":"#VALUE!"},{"$error":"#VALUE!"}]
[null,"",null,null,null,null,null,"","","",{"$error":"#VALUE!"},{"$error":"#VALUE!"}]
[null,"",null,null,null,null,null,"","","",{"$error":"#VALUE!"},{"$error":"#VALUE!"}]
[null,"",null,null,null,null,null,"","","",{"$error":"#VALUE!"},{"$error":"#VALUE!"}]
[null,"",null,null,null,null,null,"","","",{"$error":"#VALUE!"},{"$error":"#VALUE!"}]
[null,"",null,null,null,null,null,"","","",{"$error":"#VALUE!"},{"$error":"#VALUE!"}]
[null,"",null,null,null,null,null,"","","",{"$error":"#VALUE!"},{"$error":"#VALUE!"}]
[null,"",null,null,null,null,null,"","","",{"$error":"#VALUE!"},{"$error":"#VALUE!"}]
[null,"",null,null,null,null,null,"","","",{"$error":"#VALUE!"},{"$error":"#VALUE!"}]
[null,"",null,null,null,null,null,"","","",{"$error":"#VALUE!"},{"$error":"#VALUE!"}]
[null,"",null,null,null,null,null,"","","",{"$error":"#VALUE!"},{"$error":"#VALUE!"}]
[null,"",null,null,null,null,null,"","","",{"$error":"#VALUE!"},{"$error":"#VALUE!"}]
[null,"",null,null,null,null,null,"","","",{"$error":"#VALUE!"},{"$error":"#VALUE!"}]
[null,"",null,null,null,null,null,"","","",{"$error":"#VALUE!"},{"$error":"#VALUE!"}]
[null,"",null,null,null,null,null,"","","",{"$error":"#VALUE!"},{"$error":"#VALUE!"}]
[null,"",null,null,null,null,null,"","","",{"$error":"#VALUE!"},{"$error":"#VALUE!"}]
[null,"",null,null,null,null,null,"","","",{"$error":"#VALUE!"},{"$error":"#VALUE!"}]
[null,"",null,null,null,null,null,"","","",{"$error":"#VALUE!"},{"$error":"#VALUE!"}]
[null,"",null,null,null,null,null,"","","",{"$error":"#VALUE!"},{"$error":"#VALUE!"}]
[null,"",null,null,null,null,null,"","","",{"$error":"#VALUE!"},{"$error":"#VALUE!"}]
[null,"",null,null,null,null,null,"","","",{"$error":"#VALUE!"},{"$error":"#VALUE!"}]
[null,"",null,null,null,null,null,"","","",{"$error":"#VALUE!"},{"$error":"#VALUE!"}]
[null,"",null,null,null,null,null,"","","",{"$error":"#VALUE!"},{"$error":"#VALUE!"}]
[null,"",null,null,null,null,null,"","","",{"$error":"#VALUE!"},{"$error":"#VALUE!"}]
[null,"",null,null,null,null,null,"","","",{"$error":"#VALUE!"},{"$error":"#VALUE!"}]
[null,"",null,null,null,null,null,"","","",{"$error":"#VALUE!"},{"$error":"#VALUE!"}]
[null,"",null,null,null,null,null,"","","",{"$error":"#VALUE!"},{"$error":"#VALUE!"}]
[null,"",null,null,null,null,null,"","","",{"$error":"#VALUE!"},{"$error":"#VALUE!"}]
[null,"",null,null,null,null,null,"","","",{"$error":"#VALUE!"},{"$error":"#VALUE!"}]
[null,"",null,null,null,null,null,"","","",{"$error":"#VALUE!"},{"$error":"#VALUE!"}]
[null,"",null,null,null,null,null,"","","",{"$error":"#VALUE!"},{"$error":"#VALUE!"}]
[null,"",null,null,null,null,null,"","","",{"$error":"#VALUE!"},{"$error":"#VALUE!"}]
[null,"",null,null,null,null,null,"","","",{"$error":"#VALUE!"},{"$error":"#VALUE!"}]
[null,"",null,null,null,null,null,"","","",{"$error":"#VALUE!"},{"$error":"#VALUE!"}]
[null,"",null,null,null,null,null,"","","",{"$error":"#VALUE!"},{"$error":"#VALUE!"}]
[null,"",null,null,null,null,null,"","","",{"$error":"#VALUE!"},{"$error":"#VALUE!"}]
[null,"",null,null,null,null,null,"","","",{"$error":"#VALUE!"},{"$error":"#VALUE!"}]
[null,"",null,null,null,null,null,"","","",{"$error":"#VALUE!"},{"$error":"#VALUE!"}]
[null,"",null,null,null,null,null,"","","",{"$error":"#VALUE!"},{"$error":"#VALUE!"}]
[null,"",null,null,null,null,null,"","","",{"$error":"#VALUE!"},{"$error":"#VALUE!"}]
[null,"",null,null,null,null,null,"","","",{"$error":"#VALUE!"},{"$error":"#VALUE!"}]
[null,"",null,null,null,null,null,"","","",{"$error":"#VALUE!"},{"$error":"#VALUE!"}]
[null,"",null,null,null,null,null,"","","",{"$error":"#VALUE!"},{"$error":"#VALUE!"}]
[null,"",null,null,null,null,null,"","","",{"$error":"#VALUE!"},{"$error":"#VALUE!"}]
[null,"",null,null,null,null,null,"","","",{"$error":"#VALUE!"},{"$error":"#VALUE!"}]
[null,"",null,null,null,null,null,"","","",{"$error":"#VALUE!"},{"$error":"#VALUE!"}]
[null,"",null,null,null,null,null,"","","",{"$error":"#VALUE!"},{"$error":"#VALUE!"}]
[null,"",null,null,null,null,null,"","","",{"$error":"#VALUE!"},{"$error":"#VALUE!"}]
[null,"",null,null,null,null,null,"","","",{"$error":"#VALUE!"},{"$error":"#VALUE!"}]
[null,"",null,null,null,null,null,"","","",{"$error":"#VALUE!"},{"$error":"#VALUE!"}]
[null,"",null,null,null,null,null,{"$f":"IF(G71=\"\",\"\",G71)","v":""},{"$f":"IF(D71=\"\",\"\",ROUNDDOWN(H71*D71,0))","v":""},{"$f":"IF(C71=\"\",\"\",\"เลือกปริ้น\")","v":""},{"$f":"(H71*7%)+H71","v":{"$error":"#VALUE!"}},{"$f":"D71*K71","v":{"$error":"#VALUE!"}}]
[null,{"$f":"IF(D72=\"\",\"\",B71+1)","v":""},null,null,null,null,null,"","","",{"$error":"#VALUE!"},{"$error":"#VALUE!"}]
[null,"",null,null,null,null,null,"","","",{"$error":"#VALUE!"},{"$error":"#VALUE!"}]
[null,"",null,null,null,null,null,"","","",{"$error":"#VALUE!"},{"$error":"#VALUE!"}]
[null,"",null,null,null,null,null,"","","",{"$error":"#VALUE!"},{"$error":"#VALUE!"}]
[null,"",null,null,null,null,null,"","","",{"$error":"#VALUE!"},{"$error":"#VALUE!"}]
[null,"",null,null,null,null,null,"","","",{"$error":"#VALUE!"},{"$error":"#VALUE!"}]
[null,"",null,null,null,null,null,"","","",{"$error":"#VALUE!"},{"$error":"#VALUE!"}]
[null,"",null,null,null,null,null,"","","",{"$error":"#VALUE!"},{"$error":"#VALUE!"}]
[null,{"$f":"IF(C80=\"\",\"\",B79+1)","v":""},null,null,null,null,null,"รวมเงิน",{"$f":"IF(J2=0,SUM(I6:I79),SUM(I6:I79)*100/107)","v":5971.9626168224295},{"$f":"IF(I80=\"\",\"\",\"เลือกปริ้น\")","v":"เลือกปริ้น"},"ไม่รวม VAT"]
[null,{"$f":"IF(C81=\"\",\"\",B80+1)","v":""},null,null,null,null,null,"ภาษีมูลค่าเพิ่ม 7%",{"$f":"IF(J2=0,I80*7%,I80*7%)","v":418.03738317757012},"เลือกปริ้น"]
[null,{"$f":"\"(\"&BAHTTEXT(I80)&\")\"","v":"(ห้าพันเก้าร้อยเจ็ดสิบเอ็ดบาทเก้าสิบหกสตางค์)"},null,null,null,null,null,"รวมเป็นเงินทั้งสิ้น",{"$f":"IF(J2=0,SUM(I80:I81),SUM(I80:I81))","v":6390},"เลือกปริ้น"]

{"sheet":"ใบสั่งซื้อ","index":6,"n_rows":95,"n_cols":13,"rows_kept":95,"cut":false,"hidden":false,"merged":[[11,3,12,4],[90,4,90,6],[91,4,91,6],[92,5,92,6],[4,7,4,8],[89,4,89,6],[83,2,83,6],[84,3,84,5],[8,1,8,3],[8,4,8,6],[9,1,9,6],[11,1,12,1],[11,2,12,2],[5,2,5,3],[5,4,5,6],[6,1,6,3],[84,9,84,10],[85,2,85,6],[87,2,87,6],[88,2,88,6],[79,1,79,3],[79,4,79,5],[80,1,80,3],[80,4,80,5],[81,1,81,3],[81,4,81,5],[6,4,6,6],[7,1,7,3],[7,4,7,6],[0,1,1,6],[2,1,2,6],[3,1,3,3],[4,1,4,3],[4,5,4,6],[3,5,3,6]]}
[]
[]
[null,"ใบสั่งซื้อ",null,null,null,null,null,null,null,null,{"$f":"IF(F5=\"\",\"\",DAY(F5))","v":18},{"$f":"IF(F5=\"\",\"\",MONTH(F5))","v":3},{"$f":"IF(F5=\"\",\"\",YEAR(F5))","v":2562}]
[null,{"$f":"DATABASE!C19","v":"หจก. ธงชัย โอเอ เซลส์แอนเซอร์วิส"},null,null,"ใบสั่งซื้อเลขที่","108/2562"]
[null,{"$f":"DATABASE!C20","v":"68/4-5, 70 ถ.ธานี ต.ในเมือง อ.เมือง จ.บุรีรัมย์"},null,null,"วันที่ ","2562-03-18",null,"บันทึกรับใบสั่งซื้อ >>>>",null,{"$f":"F5","v":"2562-03-18"}]
[null,null,{"$f":"DATABASE!D20","v":"โทรศัพท์ 0 4461 2189"},null,{"$f":"DATABASE!C4","v":"สำนักงานสาธารณสุขอำเภอหนองหงส์"}]
[null,{"$f":"DATABASE!C21","v":313539001261},null,null,{"$f":"DATABASE!C5","v":"ที่อยู่ หมู่ที่ 14 ถนนราษฎร์บำรุง ตำบลสระแก้ว "}]
[null,"-",null,null,{"$f":"DATABASE!D15","v":"อำเภอหนองหงส์ จังหวัดบุรีรัมย์"}]
[null,"-",null,null,{"$f":"DATABASE!D5","v":"โทร. 0 4466 9276, 0 4466 9020"}]
[null,{"$f":"DATABASE!C19&\" ได้เสนอราคาต่อ \"&DATABASE!C2","v":"หจก. ธงชัย โอเอ เซลส์แอนเซอร์วิส ได้เสนอราคาต่อ สำนักงานสาธารณสุขอำเภอหนองหงส์ ถ.ราษฎร์บำรุง จังหวัดบุรีรัมย์ 31240 "}]
[null,"ซึ่งได้รับการราคาตกลงซื้อ ตามรายการ ดังต่อไปนี้"]
[null,"ลำดับ","รายการ","จำนวน",null,"ราคาต่อหน่วย","จำนวนเงิน"]
[null,null,null,null,null,"(บาท)","(บาท)",null,"<< เลือกตัวกรองก่อนปริ้นทุกครั้ง"]
[null,{"$f":"IF(แนบท้ายรายงาน!B6=\"\",\"\",แนบท้ายรายงาน!B6)","v":1},{"$f":"IF(แนบท้ายรายงาน!C6=\"\",\"\",แนบท้ายรายงาน!C6)","v":"RAM DDR 4 PC 4GB/2400"},{"$f":"IF(แนบท้ายรายงาน!D6=\"\",\"\",แนบท้ายรายงาน!D6)","v":3},{"$f":"IF(แนบท้ายรายงาน!E6=\"\",\"\",แนบท้ายรายงาน!E6)","v":"ตัว"},{"$f":"IF(แนบท้ายรายงาน!H6=\"\",\"\",แนบท้ายรายงาน!H6)","v":2130},{"$f":"แนบท้ายรายงาน!I6","v":6390},{"$f":"IF(C14=\"\",\"\",\"เลือกปริ้น\")","v":"เลือกปริ้น"}]
[null,{"$f":"IF(แนบท้ายรายงาน!B7=\"\",\"\",แนบท้ายรายงาน!B7)","v":""},{"$f":"IF(แนบท้ายรายงาน!C7=\"\",\"\",แนบท้ายรายงาน!C7)","v":""},{"$f":"IF(แนบท้ายรายงาน!D7=\"\",\"\",แนบท้ายรายงาน!D7)","v":""},{"$f":"IF(แนบท้ายรายงาน!E7=\"\",\"\",แนบท้ายรายงาน!E7)","v":""},{"$f":"IF(แนบท้ายรายงาน!H7=\"\",\"\",แนบท้ายรายงาน!H7)","v":""},{"$f":"แนบท้ายรายงาน!I7","v":""},{"$f":"IF(C15=\"\",\"\",\"เลือกปริ้น\")","v":""}]
[null,{"$f":"IF(แนบท้ายรายงาน!B8=\"\",\"\",แนบท้ายรายงาน!B8)","v":""},{"$f":"IF(แนบท้ายรายงาน!C8=\"\",\"\",แนบท้ายรายงาน!C8)","v":""},{"$f":"IF(แนบท้ายรายงาน!D8=\"\",\"\",แนบท้ายรายงาน!D8)","v":""},{"$f":"IF(แนบท้ายรายงาน!E8=\"\",\"\",แนบท้ายรายงาน!E8)","v":""},{"$f":"IF(แนบท้ายรายงาน!H8=\"\",\"\",แนบท้ายรายงาน!H8)","v":""},{"$f":"แนบท้ายรายงาน!I8","v":""},""]
[null,{"$f":"IF(แนบท้ายรายงาน!B9=\"\",\"\",แนบท้ายรายงาน!B9)","v":""},{"$f":"IF(แนบท้ายรายงาน!C9=\"\",\"\",แนบท้ายรายงาน!C9)","v":""},{"$f":"IF(แนบท้ายรายงาน!D9=\"\",\"\",แนบท้ายรายงาน!D9)","v":""},{"$f":"IF(แนบท้ายรายงาน!E9=\"\",\"\",แนบท้ายรายงาน!E9)","v":""},{"$f":"IF(แนบท้ายรายงาน!H9=\"\",\"\",แนบท้ายรายงาน!H9)","v":""},{"$f":"แนบท้ายรายงาน!I9","v":""},""]
[null,{"$f":"IF(แนบท้ายรายงาน!B10=\"\",\"\",แนบท้ายรายงาน!B10)","v":""},{"$f":"IF(แนบท้ายรายงาน!C10=\"\",\"\",แนบท้ายรายงาน!C10)","v":""},{"$f":"IF(แนบท้ายรายงาน!D10=\"\",\"\",แนบท้ายรายงาน!D10)","v":""},{"$f":"IF(แนบท้ายรายงาน!E10=\"\",\"\",แนบท้ายรายงาน!E10)","v":""},{"$f":"IF(แนบท้ายรายงาน!H10=\"\",\"\",แนบท้ายรายงาน!H10)","v":""},{"$f":"แนบท้ายรายงาน!I10","v":""},""]
[null,{"$f":"IF(แนบท้ายรายงาน!B11=\"\",\"\",แนบท้ายรายงาน!B11)","v":""},{"$f":"IF(แนบท้ายรายงาน!C11=\"\",\"\",แนบท้ายรายงาน!C11)","v":""},{"$f":"IF(แนบท้ายรายงาน!D11=\"\",\"\",แนบท้ายรายงาน!D11)","v":""},{"$f":"IF(แนบท้ายรายงาน!E11=\"\",\"\",แนบท้ายรายงาน!E11)","v":""},{"$f":"IF(แนบท้ายรายงาน!H11=\"\",\"\",แนบท้ายรายงาน!H11)","v":""},{"$f":"แนบท้ายรายงาน!I11","v":""},""]
[null,{"$f":"IF(แนบท้ายรายงาน!B12=\"\",\"\",แนบท้ายรายงาน!B12)","v":""},{"$f":"IF(แนบท้ายรายงาน!C12=\"\",\"\",แนบท้ายรายงาน!C12)","v":""},{"$f":"IF(แนบท้ายรายงาน!D12=\"\",\"\",แนบท้ายรายงาน!D12)","v":""},{"$f":"IF(แนบท้ายรายงาน!E12=\"\",\"\",แนบท้ายรายงาน!E12)","v":""},{"$f":"IF(แนบท้ายรายงาน!H12=\"\",\"\",แนบท้ายรายงาน!H12)","v":""},{"$f":"แนบท้ายรายงาน!I12","v":""},""]
[null,{"$f":"IF(แนบท้ายรายงาน!B13=\"\",\"\",แนบท้ายรายงาน!B13)","v":""},{"$f":"IF(แนบท้ายรายงาน!C13=\"\",\"\",แนบท้ายรายงาน!C13)","v":""},{"$f":"IF(แนบท้ายรายงาน!D13=\"\",\"\",แนบท้ายรายงาน!D13)","v":""},{"$f":"IF(แนบท้ายรายงาน!E13=\"\",\"\",แนบท้ายรายงาน!E13)","v":""},{"$f":"IF(แนบท้ายรายงาน!H13=\"\",\"\",แนบท้ายรายงาน!H13)","v":""},{"$f":"แนบท้ายรายงาน!I13","v":""},""]
[null,{"$f":"IF(แนบท้ายรายงาน!B14=\"\",\"\",แนบท้ายรายงาน!B14)","v":""},{"$f":"IF(แนบท้ายรายงาน!C14=\"\",\"\",แนบท้ายรายงาน!C14)","v":""},{"$f":"IF(แนบท้ายรายงาน!D14=\"\",\"\",แนบท้ายรายงาน!D14)","v":""},{"$f":"IF(แนบท้ายรายงาน!E14=\"\",\"\",แนบท้ายรายงาน!E14)","v":""},{"$f":"IF(แนบท้ายรายงาน!H14=\"\",\"\",แนบท้ายรายงาน!H14)","v":""},{"$f":"แนบท้ายรายงาน!I14","v":""},""]
[null,{"$f":"IF(แนบท้ายรายงาน!B15=\"\",\"\",แนบท้ายรายงาน!B15)","v":""},{"$f":"IF(แนบท้ายรายงาน!C15=\"\",\"\",แนบท้ายรายงาน!C15)","v":""},{"$f":"IF(แนบท้ายรายงาน!D15=\"\",\"\",แนบท้ายรายงาน!D15)","v":""},{"$f":"IF(แนบท้ายรายงาน!E15=\"\",\"\",แนบท้ายรายงาน!E15)","v":""},{"$f":"IF(แนบท้ายรายงาน!H15=\"\",\"\",แนบท้ายรายงาน!H15)","v":""},{"$f":"แนบท้ายรายงาน!I15","v":""},""]
[null,{"$f":"IF(แนบท้ายรายงาน!B16=\"\",\"\",แนบท้ายรายงาน!B16)","v":""},{"$f":"IF(แนบท้ายรายงาน!C16=\"\",\"\",แนบท้ายรายงาน!C16)","v":""},{"$f":"IF(แนบท้ายรายงาน!D16=\"\",\"\",แนบท้ายรายงาน!D16)","v":""},{"$f":"IF(แนบท้ายรายงาน!E16=\"\",\"\",แนบท้ายรายงาน!E16)","v":""},{"$f":"IF(แนบท้ายรายงาน!H16=\"\",\"\",แนบท้ายรายงาน!H16)","v":""},{"$f":"แนบท้ายรายงาน!I16","v":""},""]
[null,{"$f":"IF(แนบท้ายรายงาน!B17=\"\",\"\",แนบท้ายรายงาน!B17)","v":""},{"$f":"IF(แนบท้ายรายงาน!C17=\"\",\"\",แนบท้ายรายงาน!C17)","v":""},{"$f":"IF(แนบท้ายรายงาน!D17=\"\",\"\",แนบท้ายรายงาน!D17)","v":""},{"$f":"IF(แนบท้ายรายงาน!E17=\"\",\"\",แนบท้ายรายงาน!E17)","v":""},{"$f":"IF(แนบท้ายรายงาน!H17=\"\",\"\",แนบท้ายรายงาน!H17)","v":""},{"$f":"แนบท้ายรายงาน!I17","v":""},""]
[null,{"$f":"IF(แนบท้ายรายงาน!B18=\"\",\"\",แนบท้ายรายงาน!B18)","v":""},{"$f":"IF(แนบท้ายรายงาน!C18=\"\",\"\",แนบท้ายรายงาน!C18)","v":""},{"$f":"IF(แนบท้ายรายงาน!D18=\"\",\"\",แนบท้ายรายงาน!D18)","v":""},{"$f":"IF(แนบท้ายรายงาน!E18=\"\",\"\",แนบท้ายรายงาน!E18)","v":""},{"$f":"IF(แนบท้ายรายงาน!H18=\"\",\"\",แนบท้ายรายงาน!H18)","v":""},{"$f":"แนบท้ายรายงาน!I18","v":""},""]
[null,{"$f":"IF(แนบท้ายรายงาน!B19=\"\",\"\",แนบท้ายรายงาน!B19)","v":""},{"$f":"IF(แนบท้ายรายงาน!C19=\"\",\"\",แนบท้ายรายงาน!C19)","v":""},{"$f":"IF(แนบท้ายรายงาน!D19=\"\",\"\",แนบท้ายรายงาน!D19)","v":""},{"$f":"IF(แนบท้ายรายงาน!E19=\"\",\"\",แนบท้ายรายงาน!E19)","v":""},{"$f":"IF(แนบท้ายรายงาน!H19=\"\",\"\",แนบท้ายรายงาน!H19)","v":""},{"$f":"แนบท้ายรายงาน!I19","v":""},""]
[null,{"$f":"IF(แนบท้ายรายงาน!B20=\"\",\"\",แนบท้ายรายงาน!B20)","v":""},{"$f":"IF(แนบท้ายรายงาน!C20=\"\",\"\",แนบท้ายรายงาน!C20)","v":""},{"$f":"IF(แนบท้ายรายงาน!D20=\"\",\"\",แนบท้ายรายงาน!D20)","v":""},{"$f":"IF(แนบท้ายรายงาน!E20=\"\",\"\",แนบท้ายรายงาน!E20)","v":""},{"$f":"IF(แนบท้ายรายงาน!H20=\"\",\"\",แนบท้ายรายงาน!H20)","v":""},{"$f":"แนบท้ายรายงาน!I20","v":""},""]
[null,{"$f":"IF(แนบท้ายรายงาน!B21=\"\",\"\",แนบท้ายรายงาน!B21)","v":""},{"$f":"IF(แนบท้ายรายงาน!C21=\"\",\"\",แนบท้ายรายงาน!C21)","v":""},{"$f":"IF(แนบท้ายรายงาน!D21=\"\",\"\",แนบท้ายรายงาน!D21)","v":""},{"$f":"IF(แนบท้ายรายงาน!E21=\"\",\"\",แนบท้ายรายงาน!E21)","v":""},{"$f":"IF(แนบท้ายรายงาน!H21=\"\",\"\",แนบท้ายรายงาน!H21)","v":""},{"$f":"แนบท้ายรายงาน!I21","v":""},""]
[null,{"$f":"IF(แนบท้ายรายงาน!B22=\"\",\"\",แนบท้ายรายงาน!B22)","v":""},{"$f":"IF(แนบท้ายรายงาน!C22=\"\",\"\",แนบท้ายรายงาน!C22)","v":""},{"$f":"IF(แนบท้ายรายงาน!D22=\"\",\"\",แนบท้ายรายงาน!D22)","v":""},{"$f":"IF(แนบท้ายรายงาน!E22=\"\",\"\",แนบท้ายรายงาน!E22)","v":""},{"$f":"IF(แนบท้ายรายงาน!H22=\"\",\"\",แนบท้ายรายงาน!H22)","v":""},{"$f":"แนบท้ายรายงาน!I22","v":""},""]
[null,{"$f":"IF(แนบท้ายรายงาน!B23=\"\",\"\",แนบท้ายรายงาน!B23)","v":""},{"$f":"IF(แนบท้ายรายงาน!C23=\"\",\"\",แนบท้ายรายงาน!C23)","v":""},{"$f":"IF(แนบท้ายรายงาน!D23=\"\",\"\",แนบท้ายรายงาน!D23)","v":""},{"$f":"IF(แนบท้ายรายงาน!E23=\"\",\"\",แนบท้ายรายงาน!E23)","v":""},{"$f":"IF(แนบท้ายรายงาน!H23=\"\",\"\",แนบท้ายรายงาน!H23)","v":""},{"$f":"แนบท้ายรายงาน!I23","v":""},""]
[null,{"$f":"IF(แนบท้ายรายงาน!B24=\"\",\"\",แนบท้ายรายงาน!B24)","v":""},{"$f":"IF(แนบท้ายรายงาน!C24=\"\",\"\",แนบท้ายรายงาน!C24)","v":""},{"$f":"IF(แนบท้ายรายงาน!D24=\"\",\"\",แนบท้ายรายงาน!D24)","v":""},{"$f":"IF(แนบท้ายรายงาน!E24=\"\",\"\",แนบท้ายรายงาน!E24)","v":""},{"$f":"IF(แนบท้ายรายงาน!H24=\"\",\"\",แนบท้ายรายงาน!H24)","v":""},{"$f":"แนบท้ายรายงาน!I24","v":""},""]
[null,{"$f":"IF(แนบท้ายรายงาน!B25=\"\",\"\",แนบท้ายรายงาน!B25)","v":""},{"$f":"IF(แนบท้ายรายงาน!C25=\"\",\"\",แนบท้ายรายงาน!C25)","v":""},{"$f":"IF(แนบท้ายรายงาน!D25=\"\",\"\",แนบท้ายรายงาน!D25)","v":""},{"$f":"IF(แนบท้ายรายงาน!E25=\"\",\"\",แนบท้ายรายงาน!E25)","v":""},{"$f":"IF(แนบท้ายรายงาน!H25=\"\",\"\",แนบท้ายรายงาน!H25)","v":""},{"$f":"แนบท้ายรายงาน!I25","v":""},""]
[null,{"$f":"IF(แนบท้ายรายงาน!B26=\"\",\"\",แนบท้ายรายงาน!B26)","v":""},{"$f":"IF(แนบท้ายรายงาน!C26=\"\",\"\",แนบท้ายรายงาน!C26)","v":""},{"$f":"IF(แนบท้ายรายงาน!D26=\"\",\"\",แนบท้ายรายงาน!D26)","v":""},{"$f":"IF(แนบท้ายรายงาน!E26=\"\",\"\",แนบท้ายรายงาน!E26)","v":""},{"$f":"IF(แนบท้ายรายงาน!H26=\"\",\"\",แนบท้ายรายงาน!H26)","v":""},{"$f":"แนบท้ายรายงาน!I26","v":""},""]
[null,{"$f":"IF(แนบท้ายรายงาน!B27=\"\",\"\",แนบท้ายรายงาน!B27)","v":""},{"$f":"IF(แนบท้ายรายงาน!C27=\"\",\"\",แนบท้ายรายงาน!C27)","v":""},{"$f":"IF(แนบท้ายรายงาน!D27=\"\",\"\",แนบท้ายรายงาน!D27)","v":""},{"$f":"IF(แนบท้ายรายงาน!E27=\"\",\"\",แนบท้ายรายงาน!E27)","v":""},{"$f":"IF(แนบท้ายรายงาน!H27=\"\",\"\",แนบท้ายรายงาน!H27)","v":""},{"$f":"แนบท้ายรายงาน!I27","v":""},""]
[null,{"$f":"IF(แนบท้ายรายงาน!B28=\"\",\"\",แนบท้ายรายงาน!B28)","v":""},{"$f":"IF(แนบท้ายรายงาน!C28=\"\",\"\",แนบท้ายรายงาน!C28)","v":""},{"$f":"IF(แนบท้ายรายงาน!D28=\"\",\"\",แนบท้ายรายงาน!D28)","v":""},{"$f":"IF(แนบท้ายรายงาน!E28=\"\",\"\",แนบท้ายรายงาน!E28)","v":""},{"$f":"IF(แนบท้ายรายงาน!H28=\"\",\"\",แนบท้ายรายงาน!H28)","v":""},{"$f":"แนบท้ายรายงาน!I28","v":""},""]
[null,{"$f":"IF(แนบท้ายรายงาน!B29=\"\",\"\",แนบท้ายรายงาน!B29)","v":""},{"$f":"IF(แนบท้ายรายงาน!C29=\"\",\"\",แนบท้ายรายงาน!C29)","v":""},{"$f":"IF(แนบท้ายรายงาน!D29=\"\",\"\",แนบท้ายรายงาน!D29)","v":""},{"$f":"IF(แนบท้ายรายงาน!E29=\"\",\"\",แนบท้ายรายงาน!E29)","v":""},{"$f":"IF(แนบท้ายรายงาน!H29=\"\",\"\",แนบท้ายรายงาน!H29)","v":""},{"$f":"แนบท้ายรายงาน!I29","v":""},""]
[null,{"$f":"IF(แนบท้ายรายงาน!B30=\"\",\"\",แนบท้ายรายงาน!B30)","v":""},{"$f":"IF(แนบท้ายรายงาน!C30=\"\",\"\",แนบท้ายรายงาน!C30)","v":""},{"$f":"IF(แนบท้ายรายงาน!D30=\"\",\"\",แนบท้ายรายงาน!D30)","v":""},{"$f":"IF(แนบท้ายรายงาน!E30=\"\",\"\",แนบท้ายรายงาน!E30)","v":""},{"$f":"IF(แนบท้ายรายงาน!H30=\"\",\"\",แนบท้ายรายงาน!H30)","v":""},{"$f":"แนบท้ายรายงาน!I30","v":""},""]
[null,{"$f":"IF(แนบท้ายรายงาน!B31=\"\",\"\",แนบท้ายรายงาน!B31)","v":""},{"$f":"IF(แนบท้ายรายงาน!C31=\"\",\"\",แนบท้ายรายงาน!C31)","v":""},{"$f":"IF(แนบท้ายรายงาน!D31=\"\",\"\",แนบท้ายรายงาน!D31)","v":""},{"$f":"IF(แนบท้ายรายงาน!E31=\"\",\"\",แนบท้ายรายงาน!E31)","v":""},{"$f":"IF(แนบท้ายรายงาน!H31=\"\",\"\",แนบท้ายรายงาน!H31)","v":""},{"$f":"แนบท้ายรายงาน!I31","v":""},""]
[null,{"$f":"IF(แนบท้ายรายงาน!B32=\"\",\"\",แนบท้ายรายงาน!B32)","v":""},{"$f":"IF(แนบท้ายรายงาน!C32=\"\",\"\",แนบท้ายรายงาน!C32)","v":""},{"$f":"IF(แนบท้ายรายงาน!D32=\"\",\"\",แนบท้ายรายงาน!D32)","v":""},{"$f":"IF(แนบท้ายรายงาน!E32=\"\",\"\",แนบท้ายรายงาน!E32)","v":""},{"$f":"IF(แนบท้ายรายงาน!H32=\"\",\"\",แนบท้ายรายงาน!H32)","v":""},{"$f":"แนบท้ายรายงาน!I32","v":""},""]
[null,{"$f":"IF(แนบท้ายรายงาน!B33=\"\",\"\",แนบท้ายรายงาน!B33)","v":""},{"$f":"IF(แนบท้ายรายงาน!C33=\"\",\"\",แนบท้ายรายงาน!C33)","v":""},{"$f":"IF(แนบท้ายรายงาน!D33=\"\",\"\",แนบท้ายรายงาน!D33)","v":""},{"$f":"IF(แนบท้ายรายงาน!E33=\"\",\"\",แนบท้ายรายงาน!E33)","v":""},{"$f":"IF(แนบท้ายรายงาน!H33=\"\",\"\",แนบท้ายรายงาน!H33)","v":""},{"$f":"แนบท้ายรายงาน!I33","v":""},""]
[null,{"$f":"IF(แนบท้ายรายงาน!B34=\"\",\"\",แนบท้ายรายงาน!B34)","v":""},{"$f":"IF(แนบท้ายรายงาน!C34=\"\",\"\",แนบท้ายรายงาน!C34)","v":""},{"$f":"IF(แนบท้ายรายงาน!D34=\"\",\"\",แนบท้ายรายงาน!D34)","v":""},{"$f":"IF(แนบท้ายรายงาน!E34=\"\",\"\",แนบท้ายรายงาน!E34)","v":""},{"$f":"IF(แนบท้ายรายงาน!H34=\"\",\"\",แนบท้ายรายงาน!H34)","v":""},{"$f":"แนบท้ายรายงาน!I34","v":""},""]
[null,{"$f":"IF(แนบท้ายรายงาน!B35=\"\",\"\",แนบท้ายรายงาน!B35)","v":""},{"$f":"IF(แนบท้ายรายงาน!C35=\"\",\"\",แนบท้ายรายงาน!C35)","v":""},{"$f":"IF(แนบท้ายรายงาน!D35=\"\",\"\",แนบท้ายรายงาน!D35)","v":""},{"$f":"IF(แนบท้ายรายงาน!E35=\"\",\"\",แนบท้ายรายงาน!E35)","v":""},{"$f":"IF(แนบท้ายรายงาน!H35=\"\",\"\",แนบท้ายรายงาน!H35)","v":""},{"$f":"แนบท้ายรายงาน!I35","v":""},""]
[null,{"$f":"IF(แนบท้ายรายงาน!B36=\"\",\"\",แนบท้ายรายงาน!B36)","v":""},{"$f":"IF(แนบท้ายรายงาน!C36=\"\",\"\",แนบท้ายรายงาน!C36)","v":""},{"$f":"IF(แนบท้ายรายงาน!D36=\"\",\"\",แนบท้ายรายงาน!D36)","v":""},{"$f":"IF(แนบท้ายรายงาน!E36=\"\",\"\",แนบท้ายรายงาน!E36)","v":""},{"$f":"IF(แนบท้ายรายงาน!H36=\"\",\"\",แนบท้ายรายงาน!H36)","v":""},{"$f":"แนบท้ายรายงาน!I36","v":""},""]
[null,{"$f":"IF(แนบท้ายรายงาน!B37=\"\",\"\",แนบท้ายรายงาน!B37)","v":""},{"$f":"IF(แนบท้ายรายงาน!C37=\"\",\"\",แนบท้ายรายงาน!C37)","v":""},{"$f":"IF(แนบท้ายรายงาน!D37=\"\",\"\",แนบท้ายรายงาน!D37)","v":""},{"$f":"IF(แนบท้ายรายงาน!E37=\"\",\"\",แนบท้ายรายงาน!E37)","v":""},{"$f":"IF(แนบท้ายรายงาน!H37=\"\",\"\",แนบท้ายรายงาน!H37)","v":""},{"$f":"แนบท้ายรายงาน!I37","v":""},""]
[null,{"$f":"IF(แนบท้ายรายงาน!B38=\"\",\"\",แนบท้ายรายงาน!B38)","v":""},{"$f":"IF(แนบท้ายรายงาน!C38=\"\",\"\",แนบท้ายรายงาน!C38)","v":""},{"$f":"IF(แนบท้ายรายงาน!D38=\"\",\"\",แนบท้ายรายงาน!D38)","v":""},{"$f":"IF(แนบท้ายรายงาน!E38=\"\",\"\",แนบท้ายรายงาน!E38)","v":""},{"$f":"IF(แนบท้ายรายงาน!H38=\"\",\"\",แนบท้ายรายงาน!H38)","v":""},{"$f":"แนบท้ายรายงาน!I38","v":""},""]
[null,{"$f":"IF(แนบท้ายรายงาน!B39=\"\",\"\",แนบท้ายรายงาน!B39)","v":""},{"$f":"IF(แนบท้ายรายงาน!C39=\"\",\"\",แนบท้ายรายงาน!C39)","v":""},{"$f":"IF(แนบท้ายรายงาน!D39=\"\",\"\",แนบท้ายรายงาน!D39)","v":""},{"$f":"IF(แนบท้ายรายงาน!E39=\"\",\"\",แนบท้ายรายงาน!E39)","v":""},{"$f":"IF(แนบท้ายรายงาน!H39=\"\",\"\",แนบท้ายรายงาน!H39)","v":""},{"$f":"แนบท้ายรายงาน!I39","v":""},""]
[null,{"$f":"IF(แนบท้ายรายงาน!B40=\"\",\"\",แนบท้ายรายงาน!B40)","v":""},{"$f":"IF(แนบท้ายรายงาน!C40=\"\",\"\",แนบท้ายรายงาน!C40)","v":""},{"$f":"IF(แนบท้ายรายงาน!D40=\"\",\"\",แนบท้ายรายงาน!D40)","v":""},{"$f":"IF(แนบท้ายรายงาน!E40=\"\",\"\",แนบท้ายรายงาน!E40)","v":""},{"$f":"IF(แนบท้ายรายงาน!H40=\"\",\"\",แนบท้ายรายงาน!H40)","v":""},{"$f":"แนบท้ายรายงาน!I40","v":""},""]
[null,{"$f":"IF(แนบท้ายรายงาน!B41=\"\",\"\",แนบท้ายรายงาน!B41)","v":""},{"$f":"IF(แนบท้ายรายงาน!C41=\"\",\"\",แนบท้ายรายงาน!C41)","v":""},{"$f":"IF(แนบท้ายรายงาน!D41=\"\",\"\",แนบท้ายรายงาน!D41)","v":""},{"$f":"IF(แนบท้ายรายงาน!E41=\"\",\"\",แนบท้ายรายงาน!E41)","v":""},{"$f":"IF(แนบท้ายรายงาน!H41=\"\",\"\",แนบท้ายรายงาน!H41)","v":""},{"$f":"แนบท้ายรายงาน!I41","v":""},""]
[null,{"$f":"IF(แนบท้ายรายงาน!B42=\"\",\"\",แนบท้ายรายงาน!B42)","v":""},{"$f":"IF(แนบท้ายรายงาน!C42=\"\",\"\",แนบท้ายรายงาน!C42)","v":""},{"$f":"IF(แนบท้ายรายงาน!D42=\"\",\"\",แนบท้ายรายงาน!D42)","v":""},{"$f":"IF(แนบท้ายรายงาน!E42=\"\",\"\",แนบท้ายรายงาน!E42)","v":""},{"$f":"IF(แนบท้ายรายงาน!H42=\"\",\"\",แนบท้ายรายงาน!H42)","v":""},{"$f":"แนบท้ายรายงาน!I42","v":""},""]
[null,{"$f":"IF(แนบท้ายรายงาน!B43=\"\",\"\",แนบท้ายรายงาน!B43)","v":""},{"$f":"IF(แนบท้ายรายงาน!C43=\"\",\"\",แนบท้ายรายงาน!C43)","v":""},{"$f":"IF(แนบท้ายรายงาน!D43=\"\",\"\",แนบท้ายรายงาน!D43)","v":""},{"$f":"IF(แนบท้ายรายงาน!E43=\"\",\"\",แนบท้ายรายงาน!E43)","v":""},{"$f":"IF(แนบท้ายรายงาน!H43=\"\",\"\",แนบท้ายรายงาน!H43)","v":""},{"$f":"แนบท้ายรายงาน!I43","v":""},""]
[null,{"$f":"IF(แนบท้ายรายงาน!B44=\"\",\"\",แนบท้ายรายงาน!B44)","v":""},{"$f":"IF(แนบท้ายรายงาน!C44=\"\",\"\",แนบท้ายรายงาน!C44)","v":""},{"$f":"IF(แนบท้ายรายงาน!D44=\"\",\"\",แนบท้ายรายงาน!D44)","v":""},{"$f":"IF(แนบท้ายรายงาน!E44=\"\",\"\",แนบท้ายรายงาน!E44)","v":""},{"$f":"IF(แนบท้ายรายงาน!H44=\"\",\"\",แนบท้ายรายงาน!H44)","v":""},{"$f":"แนบท้ายรายงาน!I44","v":""},""]
[null,{"$f":"IF(แนบท้ายรายงาน!B45=\"\",\"\",แนบท้ายรายงาน!B45)","v":""},{"$f":"IF(แนบท้ายรายงาน!C45=\"\",\"\",แนบท้ายรายงาน!C45)","v":""},{"$f":"IF(แนบท้ายรายงาน!D45=\"\",\"\",แนบท้ายรายงาน!D45)","v":""},{"$f":"IF(แนบท้ายรายงาน!E45=\"\",\"\",แนบท้ายรายงาน!E45)","v":""},{"$f":"IF(แนบท้ายรายงาน!H45=\"\",\"\",แนบท้ายรายงาน!H45)","v":""},{"$f":"แนบท้ายรายงาน!I45","v":""},""]
[null,{"$f":"IF(แนบท้ายรายงาน!B46=\"\",\"\",แนบท้ายรายงาน!B46)","v":""},{"$f":"IF(แนบท้ายรายงาน!C46=\"\",\"\",แนบท้ายรายงาน!C46)","v":""},{"$f":"IF(แนบท้ายรายงาน!D46=\"\",\"\",แนบท้ายรายงาน!D46)","v":""},{"$f":"IF(แนบท้ายรายงาน!E46=\"\",\"\",แนบท้ายรายงาน!E46)","v":""},{"$f":"IF(แนบท้ายรายงาน!H46=\"\",\"\",แนบท้ายรายงาน!H46)","v":""},{"$f":"แนบท้ายรายงาน!I46","v":""},""]
[null,{"$f":"IF(แนบท้ายรายงาน!B47=\"\",\"\",แนบท้ายรายงาน!B47)","v":""},{"$f":"IF(แนบท้ายรายงาน!C47=\"\",\"\",แนบท้ายรายงาน!C47)","v":""},{"$f":"IF(แนบท้ายรายงาน!D47=\"\",\"\",แนบท้ายรายงาน!D47)","v":""},{"$f":"IF(แนบท้ายรายงาน!E47=\"\",\"\",แนบท้ายรายงาน!E47)","v":""},{"$f":"IF(แนบท้ายรายงาน!H47=\"\",\"\",แนบท้ายรายงาน!H47)","v":""},{"$f":"แนบท้ายรายงาน!I47","v":""},""]
[null,{"$f":"IF(แนบท้ายรายงาน!B48=\"\",\"\",แนบท้ายรายงาน!B48)","v":""},{"$f":"IF(แนบท้ายรายงาน!C48=\"\",\"\",แนบท้ายรายงาน!C48)","v":""},{"$f":"IF(แนบท้ายรายงาน!D48=\"\",\"\",แนบท้ายรายงาน!D48)","v":""},{"$f":"IF(แนบท้ายรายงาน!E48=\"\",\"\",แนบท้ายรายงาน!E48)","v":""},{"$f":"IF(แนบท้ายรายงาน!H48=\"\",\"\",แนบท้ายรายงาน!H48)","v":""},{"$f":"แนบท้ายรายงาน!I48","v":""},""]
[null,{"$f":"IF(แนบท้ายรายงาน!B49=\"\",\"\",แนบท้ายรายงาน!B49)","v":""},{"$f":"IF(แนบท้ายรายงาน!C49=\"\",\"\",แนบท้ายรายงาน!C49)","v":""},{"$f":"IF(แนบท้ายรายงาน!D49=\"\",\"\",แนบท้ายรายงาน!D49)","v":""},{"$f":"IF(แนบท้ายรายงาน!E49=\"\",\"\",แนบท้ายรายงาน!E49)","v":""},{"$f":"IF(แนบท้ายรายงาน!H49=\"\",\"\",แนบท้ายรายงาน!H49)","v":""},{"$f":"แนบท้ายรายงาน!I49","v":""},""]
[null,{"$f":"IF(แนบท้ายรายงาน!B50=\"\",\"\",แนบท้ายรายงาน!B50)","v":""},{"$f":"IF(แนบท้ายรายงาน!C50=\"\",\"\",แนบท้ายรายงาน!C50)","v":""},{"$f":"IF(แนบท้ายรายงาน!D50=\"\",\"\",แนบท้ายรายงาน!D50)","v":""},{"$f":"IF(แนบท้ายรายงาน!E50=\"\",\"\",แนบท้ายรายงาน!E50)","v":""},{"$f":"IF(แนบท้ายรายงาน!H50=\"\",\"\",แนบท้ายรายงาน!H50)","v":""},{"$f":"แนบท้ายรายงาน!I50","v":""},""]
[null,{"$f":"IF(แนบท้ายรายงาน!B51=\"\",\"\",แนบท้ายรายงาน!B51)","v":""},{"$f":"IF(แนบท้ายรายงาน!C51=\"\",\"\",แนบท้ายรายงาน!C51)","v":""},{"$f":"IF(แนบท้ายรายงาน!D51=\"\",\"\",แนบท้ายรายงาน!D51)","v":""},{"$f":"IF(แนบท้ายรายงาน!E51=\"\",\"\",แนบท้ายรายงาน!E51)","v":""},{"$f":"IF(แนบท้ายรายงาน!H51=\"\",\"\",แนบท้ายรายงาน!H51)","v":""},{"$f":"แนบท้ายรายงาน!I51","v":""},""]
[null,{"$f":"IF(แนบท้ายรายงาน!B52=\"\",\"\",แนบท้ายรายงาน!B52)","v":""},{"$f":"IF(แนบท้ายรายงาน!C52=\"\",\"\",แนบท้ายรายงาน!C52)","v":""},{"$f":"IF(แนบท้ายรายงาน!D52=\"\",\"\",แนบท้ายรายงาน!D52)","v":""},{"$f":"IF(แนบท้ายรายงาน!E52=\"\",\"\",แนบท้ายรายงาน!E52)","v":""},{"$f":"IF(แนบท้ายรายงาน!H52=\"\",\"\",แนบท้ายรายงาน!H52)","v":""},{"$f":"แนบท้ายรายงาน!I52","v":""},""]
[null,{"$f":"IF(แนบท้ายรายงาน!B53=\"\",\"\",แนบท้ายรายงาน!B53)","v":""},{"$f":"IF(แนบท้ายรายงาน!C53=\"\",\"\",แนบท้ายรายงาน!C53)","v":""},{"$f":"IF(แนบท้ายรายงาน!D53=\"\",\"\",แนบท้ายรายงาน!D53)","v":""},{"$f":"IF(แนบท้ายรายงาน!E53=\"\",\"\",แนบท้ายรายงาน!E53)","v":""},{"$f":"IF(แนบท้ายรายงาน!H53=\"\",\"\",แนบท้ายรายงาน!H53)","v":""},{"$f":"แนบท้ายรายงาน!I53","v":""},""]
[null,{"$f":"IF(แนบท้ายรายงาน!B54=\"\",\"\",แนบท้ายรายงาน!B54)","v":""},{"$f":"IF(แนบท้ายรายงาน!C54=\"\",\"\",แนบท้ายรายงาน!C54)","v":""},{"$f":"IF(แนบท้ายรายงาน!D54=\"\",\"\",แนบท้ายรายงาน!D54)","v":""},{"$f":"IF(แนบท้ายรายงาน!E54=\"\",\"\",แนบท้ายรายงาน!E54)","v":""},{"$f":"IF(แนบท้ายรายงาน!H54=\"\",\"\",แนบท้ายรายงาน!H54)","v":""},{"$f":"แนบท้ายรายงาน!I54","v":""},""]
[null,{"$f":"IF(แนบท้ายรายงาน!B55=\"\",\"\",แนบท้ายรายงาน!B55)","v":""},{"$f":"IF(แนบท้ายรายงาน!C55=\"\",\"\",แนบท้ายรายงาน!C55)","v":""},{"$f":"IF(แนบท้ายรายงาน!D55=\"\",\"\",แนบท้ายรายงาน!D55)","v":""},{"$f":"IF(แนบท้ายรายงาน!E55=\"\",\"\",แนบท้ายรายงาน!E55)","v":""},{"$f":"IF(แนบท้ายรายงาน!H55=\"\",\"\",แนบท้ายรายงาน!H55)","v":""},{"$f":"แนบท้ายรายงาน!I55","v":""},""]
[null,{"$f":"IF(แนบท้ายรายงาน!B56=\"\",\"\",แนบท้ายรายงาน!B56)","v":""},{"$f":"IF(แนบท้ายรายงาน!C56=\"\",\"\",แนบท้ายรายงาน!C56)","v":""},{"$f":"IF(แนบท้ายรายงาน!D56=\"\",\"\",แนบท้ายรายงาน!D56)","v":""},{"$f":"IF(แนบท้ายรายงาน!E56=\"\",\"\",แนบท้ายรายงาน!E56)","v":""},{"$f":"IF(แนบท้ายรายงาน!H56=\"\",\"\",แนบท้ายรายงาน!H56)","v":""},{"$f":"แนบท้ายรายงาน!I56","v":""},""]
[null,{"$f":"IF(แนบท้ายรายงาน!B57=\"\",\"\",แนบท้ายรายงาน!B57)","v":""},{"$f":"IF(แนบท้ายรายงาน!C57=\"\",\"\",แนบท้ายรายงาน!C57)","v":""},{"$f":"IF(แนบท้ายรายงาน!D57=\"\",\"\",แนบท้ายรายงาน!D57)","v":""},{"$f":"IF(แนบท้ายรายงาน!E57=\"\",\"\",แนบท้ายรายงาน!E57)","v":""},{"$f":"IF(แนบท้ายรายงาน!H57=\"\",\"\",แนบท้ายรายงาน!H57)","v":""},{"$f":"แนบท้ายรายงาน!I57","v":""},""]
[null,{"$f":"IF(แนบท้ายรายงาน!B58=\"\",\"\",แนบท้ายรายงาน!B58)","v":""},{"$f":"IF(แนบท้ายรายงาน!C58=\"\",\"\",แนบท้ายรายงาน!C58)","v":""},{"$f":"IF(แนบท้ายรายงาน!D58=\"\",\"\",แนบท้ายรายงาน!D58)","v":""},{"$f":"IF(แนบท้ายรายงาน!E58=\"\",\"\",แนบท้ายรายงาน!E58)","v":""},{"$f":"IF(แนบท้ายรายงาน!H58=\"\",\"\",แนบท้ายรายงาน!H58)","v":""},{"$f":"แนบท้ายรายงาน!I58","v":""},""]
[null,{"$f":"IF(แนบท้ายรายงาน!B59=\"\",\"\",แนบท้ายรายงาน!B59)","v":""},{"$f":"IF(แนบท้ายรายงาน!C59=\"\",\"\",แนบท้ายรายงาน!C59)","v":""},{"$f":"IF(แนบท้ายรายงาน!D59=\"\",\"\",แนบท้ายรายงาน!D59)","v":""},{"$f":"IF(แนบท้ายรายงาน!E59=\"\",\"\",แนบท้ายรายงาน!E59)","v":""},{"$f":"IF(แนบท้ายรายงาน!H59=\"\",\"\",แนบท้ายรายงาน!H59)","v":""},{"$f":"แนบท้ายรายงาน!I59","v":""},""]
[null,{"$f":"IF(แนบท้ายรายงาน!B60=\"\",\"\",แนบท้ายรายงาน!B60)","v":""},{"$f":"IF(แนบท้ายรายงาน!C60=\"\",\"\",แนบท้ายรายงาน!C60)","v":""},{"$f":"IF(แนบท้ายรายงาน!D60=\"\",\"\",แนบท้ายรายงาน!D60)","v":""},{"$f":"IF(แนบท้ายรายงาน!E60=\"\",\"\",แนบท้ายรายงาน!E60)","v":""},{"$f":"IF(แนบท้ายรายงาน!H60=\"\",\"\",แนบท้ายรายงาน!H60)","v":""},{"$f":"แนบท้ายรายงาน!I60","v":""},""]
[null,{"$f":"IF(แนบท้ายรายงาน!B61=\"\",\"\",แนบท้ายรายงาน!B61)","v":""},{"$f":"IF(แนบท้ายรายงาน!C61=\"\",\"\",แนบท้ายรายงาน!C61)","v":""},{"$f":"IF(แนบท้ายรายงาน!D61=\"\",\"\",แนบท้ายรายงาน!D61)","v":""},{"$f":"IF(แนบท้ายรายงาน!E61=\"\",\"\",แนบท้ายรายงาน!E61)","v":""},{"$f":"IF(แนบท้ายรายงาน!H61=\"\",\"\",แนบท้ายรายงาน!H61)","v":""},{"$f":"แนบท้ายรายงาน!I61","v":""},""]
[null,{"$f":"IF(แนบท้ายรายงาน!B62=\"\",\"\",แนบท้ายรายงาน!B62)","v":""},{"$f":"IF(แนบท้ายรายงาน!C62=\"\",\"\",แนบท้ายรายงาน!C62)","v":""},{"$f":"IF(แนบท้ายรายงาน!D62=\"\",\"\",แนบท้ายรายงาน!D62)","v":""},{"$f":"IF(แนบท้ายรายงาน!E62=\"\",\"\",แนบท้ายรายงาน!E62)","v":""},{"$f":"IF(แนบท้ายรายงาน!H62=\"\",\"\",แนบท้ายรายงาน!H62)","v":""},{"$f":"แนบท้ายรายงาน!I62","v":""},""]
[null,{"$f":"IF(แนบท้ายรายงาน!B63=\"\",\"\",แนบท้ายรายงาน!B63)","v":""},{"$f":"IF(แนบท้ายรายงาน!C63=\"\",\"\",แนบท้ายรายงาน!C63)","v":""},{"$f":"IF(แนบท้ายรายงาน!D63=\"\",\"\",แนบท้ายรายงาน!D63)","v":""},{"$f":"IF(แนบท้ายรายงาน!E63=\"\",\"\",แนบท้ายรายงาน!E63)","v":""},{"$f":"IF(แนบท้ายรายงาน!H63=\"\",\"\",แนบท้ายรายงาน!H63)","v":""},{"$f":"แนบท้ายรายงาน!I63","v":""},""]
[null,{"$f":"IF(แนบท้ายรายงาน!B64=\"\",\"\",แนบท้ายรายงาน!B64)","v":""},{"$f":"IF(แนบท้ายรายงาน!C64=\"\",\"\",แนบท้ายรายงาน!C64)","v":""},{"$f":"IF(แนบท้ายรายงาน!D64=\"\",\"\",แนบท้ายรายงาน!D64)","v":""},{"$f":"IF(แนบท้ายรายงาน!E64=\"\",\"\",แนบท้ายรายงาน!E64)","v":""},{"$f":"IF(แนบท้ายรายงาน!H64=\"\",\"\",แนบท้ายรายงาน!H64)","v":""},{"$f":"แนบท้ายรายงาน!I64","v":""},""]
[null,{"$f":"IF(แนบท้ายรายงาน!B65=\"\",\"\",แนบท้ายรายงาน!B65)","v":""},{"$f":"IF(แนบท้ายรายงาน!C65=\"\",\"\",แนบท้ายรายงาน!C65)","v":""},{"$f":"IF(แนบท้ายรายงาน!D65=\"\",\"\",แนบท้ายรายงาน!D65)","v":""},{"$f":"IF(แนบท้ายรายงาน!E65=\"\",\"\",แนบท้ายรายงาน!E65)","v":""},{"$f":"IF(แนบท้ายรายงาน!H65=\"\",\"\",แนบท้ายรายงาน!H65)","v":""},{"$f":"แนบท้ายรายงาน!I65","v":""},""]
[null,{"$f":"IF(แนบท้ายรายงาน!B66=\"\",\"\",แนบท้ายรายงาน!B66)","v":""},{"$f":"IF(แนบท้ายรายงาน!C66=\"\",\"\",แนบท้ายรายงาน!C66)","v":""},{"$f":"IF(แนบท้ายรายงาน!D66=\"\",\"\",แนบท้ายรายงาน!D66)","v":""},{"$f":"IF(แนบท้ายรายงาน!E66=\"\",\"\",แนบท้ายรายงาน!E66)","v":""},{"$f":"IF(แนบท้ายรายงาน!H66=\"\",\"\",แนบท้ายรายงาน!H66)","v":""},{"$f":"แนบท้ายรายงาน!I66","v":""},""]
[null,{"$f":"IF(แนบท้ายรายงาน!B67=\"\",\"\",แนบท้ายรายงาน!B67)","v":""},{"$f":"IF(แนบท้ายรายงาน!C67=\"\",\"\",แนบท้ายรายงาน!C67)","v":""},{"$f":"IF(แนบท้ายรายงาน!D67=\"\",\"\",แนบท้ายรายงาน!D67)","v":""},{"$f":"IF(แนบท้ายรายงาน!E67=\"\",\"\",แนบท้ายรายงาน!E67)","v":""},{"$f":"IF(แนบท้ายรายงาน!H67=\"\",\"\",แนบท้ายรายงาน!H67)","v":""},{"$f":"แนบท้ายรายงาน!I67","v":""},""]
[null,{"$f":"IF(แนบท้ายรายงาน!B68=\"\",\"\",แนบท้ายรายงาน!B68)","v":""},{"$f":"IF(แนบท้ายรายงาน!C68=\"\",\"\",แนบท้ายรายงาน!C68)","v":""},{"$f":"IF(แนบท้ายรายงาน!D68=\"\",\"\",แนบท้ายรายงาน!D68)","v":""},{"$f":"IF(แนบท้ายรายงาน!E68=\"\",\"\",แนบท้ายรายงาน!E68)","v":""},{"$f":"IF(แนบท้ายรายงาน!H68=\"\",\"\",แนบท้ายรายงาน!H68)","v":""},{"$f":"แนบท้ายรายงาน!I68","v":""},""]
[null,{"$f":"IF(แนบท้ายรายงาน!B69=\"\",\"\",แนบท้ายรายงาน!B69)","v":""},{"$f":"IF(แนบท้ายรายงาน!C69=\"\",\"\",แนบท้ายรายงาน!C69)","v":""},{"$f":"IF(แนบท้ายรายงาน!D69=\"\",\"\",แนบท้ายรายงาน!D69)","v":""},{"$f":"IF(แนบท้ายรายงาน!E69=\"\",\"\",แนบท้ายรายงาน!E69)","v":""},{"$f":"IF(แนบท้ายรายงาน!H69=\"\",\"\",แนบท้ายรายงาน!H69)","v":""},{"$f":"แนบท้ายรายงาน!I69","v":""},""]
[null,{"$f":"IF(แนบท้ายรายงาน!B70=\"\",\"\",แนบท้ายรายงาน!B70)","v":""},{"$f":"IF(แนบท้ายรายงาน!C70=\"\",\"\",แนบท้ายรายงาน!C70)","v":""},{"$f":"IF(แนบท้ายรายงาน!D70=\"\",\"\",แนบท้ายรายงาน!D70)","v":""},{"$f":"IF(แนบท้ายรายงาน!E70=\"\",\"\",แนบท้ายรายงาน!E70)","v":""},{"$f":"IF(แนบท้ายรายงาน!H70=\"\",\"\",แนบท้ายรายงาน!H70)","v":""},{"$f":"แนบท้ายรายงาน!I70","v":""},""]
[null,{"$f":"IF(แนบท้ายรายงาน!B71=\"\",\"\",แนบท้ายรายงาน!B71)","v":""},{"$f":"IF(แนบท้ายรายงาน!C71=\"\",\"\",แนบท้ายรายงาน!C71)","v":""},{"$f":"IF(แนบท้ายรายงาน!D71=\"\",\"\",แนบท้ายรายงาน!D71)","v":""},{"$f":"IF(แนบท้ายรายงาน!E71=\"\",\"\",แนบท้ายรายงาน!E71)","v":""},{"$f":"IF(แนบท้ายรายงาน!H71=\"\",\"\",แนบท้ายรายงาน!H71)","v":""},{"$f":"แนบท้ายรายงาน!I71","v":""},{"$f":"IF(C79=\"\",\"\",\"เลือกปริ้น\")","v":""}]
[null,null,null,null,"รวมเป็นเงินทั้งสิ้น",null,{"$f":"แนบท้ายรายงาน!I80","v":5971.9626168224295},"เลือกปริ้น"]
[null,null,null,null,"ภาษีมูลค่าเพิ่ม",null,{"$f":"แนบท้ายรายงาน!I81","v":418.03738317757012},"เลือกปริ้น"]
[null,{"$f":"BAHTTEXT(G82)","v":"หกพันสามร้อยเก้าสิบบาทถ้วน"},null,null,"รวมเป็นเงิน",null,{"$f":"แนบท้ายรายงาน!I82","v":6390},"เลือกปริ้น"]
[null,"การซื้อ อยู่ภายใต้เงื่อนไขต่อไปนี้",null,null,null,null,null,"เลือกปริ้น"]
[null,1,{"$f":"รายงานจัดซื้อ!D16&\" \"&รายงานจัดซื้อ!G16&\" \"&I84","v":"กำหนดเวลาที่ต้องการใช้พัสดุ      ภายใน 5 วันทำการ นับถัดจากวันที่ผู้ขายได้รับใบสั่งซื้อ"},null,null,null,null,"เลือกปริ้น","วันทำการ นับถัดจากวันที่ผู้ขายได้รับใบสั่งซื้อ"]
[null,2,{"$f":"J85","v":"2562-03-25"},null,null,null,null,"เลือกปริ้น",null,{"$f":"F93+รายงานจัดซื้อ!G16+2","v":"2562-03-25"}]
[null,3,{"$f":"DATABASE!C15","v":"โรงพยาบาลส่งเสริมสุขภาพตำบลบ้านกระเบื้องน้อย"},null,null,null,null,"เลือกปริ้น"]
[null,4,"ระยะเวลารับประกัน ............ ปี ",null,null,null,null,"เลือกปริ้น"]
[null,5,"สงวนสิทธิ์ค่าปรับกรณีส่งมอบเกินกำหนด โดยคิดค่าปรับเป็นรายวันในอัตราร้อยละ 0.20 ของราคา พัสดุที่ยังไม่ได้รับมอบ",null,null,null,null,"เลือกปริ้น"]
[null,6,"ส่วนราชการสงวนสิทธิ์ที่จะไม่รับมอบถ้าปรากฏว่าสินค้านั้นมีลักษณะไม่ตรงตามรายการที่ระบุไว้ในใบสั่งซื้อ ",null,null,null,null,"เลือกปริ้น"]
[null,null,"ลงชื่อ………………………………………………….ผู้สั่งซื้อ",null,"ลงชื่อ……………………………………….ผู้รับใบสั่งซื้อ",null,null,"เลือกปริ้น"]
[null,null,{"$f":"DATABASE!C7","v":"นางจุรีพร  บัวลอย"},null,{"$f":"DATABASE!D19","v":".........................................................."},null,null,"เลือกปริ้น"]
[null,null,"หัวหน้าเจ้าหน้าที่",null,"          ผู้จัดการร้าน/ผู้รับมอบอำนาจ",null,null,"เลือกปริ้น"]
[null,"วันที่",{"$f":"F5","v":"2562-03-18"},null,"วันที่",{"$f":"J5","v":"2562-03-18"},null,"เลือกปริ้น"]
[null,{"$f":"DATABASE!C25","v":" -"},null,null,null,null,null,"เลือกปริ้น"]
[null,{"$f":"DATABASE!C26","v":" -"},null,null,null,null,null,"เลือกปริ้น"]

{"sheet":"การพิจารณา","index":7,"n_rows":98,"n_cols":13,"rows_kept":98,"cut":false,"hidden":false,"merged":[[2,4,2,5],[89,6,89,8],[31,1,31,5],[32,1,32,5],[9,1,9,5],[10,1,10,5],[29,7,29,8],[24,7,24,8],[25,7,25,8],[26,7,26,8],[27,7,27,8],[28,7,28,8],[30,7,30,8],[31,7,31,8],[32,7,32,8],[29,1,29,5],[33,7,33,8],[48,1,48,5],[11,1,11,5],[12,1,12,5],[13,1,13,5],[14,1,14,5],[15,1,15,5],[16,1,16,5],[0,1,0,10],[88,6,88,8],[2,2,2,3],[4,2,4,9],[2,7,2,9],[7,9,7,10],[7,7,7,8],[7,1,7,5],[8,1,8,5],[30,9,30,10],[31,9,31,10],[32,9,32,10],[33,9,33,10],[34,9,34,10],[8,7,8,8],[9,7,9,8],[10,7,10,8],[25,1,25,5],[26,1,26,5],[8,9,8,10],[9,9,9,10],[10,9,10,10],[24,9,24,10],[25,9,25,10],[26,9,26,10],[27,9,27,10],[28,9,28,10],[29,9,29,10],[30,1,30,5],[44,1,44,5],[45,1,45,5],[46,1,46,5],[47,1,47,5],[39,7,39,8],[40,7,40,8],[41,7,41,8],[42,7,42,8],[43,7,43,8],[34,7,34,8],[35,7,35,8],[36,7,36,8],[37,7,37,8],[38,7,38,8],[33,1,33,5],[40,1,40,5],[41,1,41,5],[42,1,42,5],[43,1,43,5],[17,1,17,5],[18,1,18,5],[19,1,19,5],[20,1,20,5],[21,1,21,5],[22,1,22,5],[23,1,23,5],[24,1,24,5],[35,1,35,5],[36,1,36,5],[37,1,37,5],[38,1,38,5],[39,1,39,5],[34,1,34,5],[27,1,27,5],[28,1,28,5],[54,1,54,5],[55,1,55,5],[56,1,56,5],[57,1,57,5],[58,1,58,5],[49,1,49,5],[50,1,50,5],[51,1,51,5],[52,1,52,5],[53,1,53,5],[72,1,72,5],[73,1,73,5],[64,1,64,5],[65,1,65,5],[66,1,66,5],[67,1,67,5],[68,1,68,5],[59,1,59,5],[60,1,60,5],[61,1,61,5],[62,1,62,5],[63,1,63,5],[79,1,79,5],[80,1,80,5],[81,1,81,5],[11,7,11,8],[12,7,12,8],[13,7,13,8],[14,7,14,8],[15,7,15,8],[16,7,16,8],[17,7,17,8],[18,7,18,8],[19,7,19,8],[20,7,20,8],[21,7,21,8],[22,7,22,8],[23,7,23,8],[74,1,74,5],[75,1,75,5],[76,1,76,5],[77,1,77,5],[78,1,78,5],[69,1,69,5],[70,1,70,5],[71,1,71,5],[49,7,49,8],[50,7,50,8],[51,7,51,8],[52,7,52,8],[53,7,53,8],[44,7,44,8],[45,7,45,8],[46,7,46,8],[47,7,47,8],[48,7,48,8],[59,7,59,8],[60,7,60,8],[61,7,61,8],[62,7,62,8],[63,7,63,8],[54,7,54,8],[55,7,55,8],[56,7,56,8],[57,7,57,8],[58,7,58,8],[77,7,77,8],[78,7,78,8],[69,7,69,8],[70,7,70,8],[71,7,71,8],[72,7,72,8],[73,7,73,8],[64,7,64,8],[65,7,65,8],[66,7,66,8],[67,7,67,8],[68,7,68,8],[35,9,35,10],[36,9,36,10],[37,9,37,10],[38,9,38,10],[39,9,39,10],[79,7,79,8],[80,7,80,8],[81,7,81,8],[11,9,11,10],[12,9,12,10],[13,9,13,10],[14,9,14,10],[15,9,15,10],[16,9,16,10],[17,9,17,10],[18,9,18,10],[19,9,19,10],[20,9,20,10],[21,9,21,10],[22,9,22,10],[23,9,23,10],[74,7,74,8],[75,7,75,8],[76,7,76,8],[45,9,45,10],[46,9,46,10],[47,9,47,10],[48,9,48,10],[49,9,49,10],[40,9,40,10],[41,9,41,10],[42,9,42,10],[43,9,43,10],[44,9,44,10],[55,9,55,10],[56,9,56,10],[57,9,57,10],[58,9,58,10],[59,9,59,10],[50,9,50,10],[51,9,51,10],[52,9,52,10],[53,9,53,10],[54,9,54,10],[65,9,65,10],[66,9,66,10],[67,9,67,10],[68,9,68,10],[69,9,69,10],[60,9,60,10],[61,9,61,10],[62,9,62,10],[63,9,63,10],[64,9,64,10],[75,9,75,10],[76,9,76,10],[77,9,77,10],[78,9,78,10],[79,9,79,10],[70,9,70,10],[71,9,71,10],[72,9,72,10],[73,9,73,10],[74,9,74,10],[96,6,96,10],[97,6,97,10],[90,5,90,10],[94,2,94,5],[95,2,95,5],[95,6,95,10],[80,9,80,10],[81,9,81,10],[82,7,82,8],[82,9,82,10],[82,1,82,6]]}
[null,"บันทึกข้อความ"]
[null,"ส่วนราชการ",null,{"$f":"DATABASE!C4&\" \"&DATABASE!D4","v":"สำนักงานสาธารณสุขอำเภอหนองหงส์ อำเภอหนองหงส์  จังหวัดบุรีรัมย์ 31240 "}]
[null,"ที่",{"$f":"DATABASE!C3","v":"บร 1332.1/"},null,null,null,"วันที่","2561-06-18"]
[null,"เรื่อง",{"$f":"รายงานจัดซื้อ!C4","v":"ซื้อวัสดุคอมพิวเตอร์ (RAM)"},null,null,null,null,null,null,null,null,"พิมพ์กรณีเกิน 5,000 บาท"]
[null,"เรียน",{"$f":"รายงานจัดซื้อ!C5","v":"ผู้ว่าราชการจังหวัดบุรีรัมย์ (โดยสาธารณสุขอำเภอหนองหงส์ปฏิบัติราชการแทน)"}]
[null,null,null,{"$f":"เห็นชอบ!C5","v":"ซื้อวัสดุคอมพิวเตอร์ (RAM)"}]
[null,"โดยวิธีเฉพาะเจาะจง ดังนี้"]
[null,"รายการพิจารณา",null,null,null,null,"ผู้ชนะการเสนอราคา","ราคาที่เสนอ",null,"ราคาที่ตกลงซื้อ",null,null,"<< เลือกตัวกรองก่อนปริ้นทุกครั้ง"]
[null,{"$f":"IF(แนบท้ายรายงาน!B6=\"\",\"\",แนบท้ายรายงาน!B6&\".\"&\" \"&แนบท้ายรายงาน!C6&\" จำนวน \"&แนบท้ายรายงาน!D6&\" \"&แนบท้ายรายงาน!E6)","v":"1. RAM DDR 4 PC 4GB/2400 จำนวน 3 ตัว"},null,null,null,null,{"$f":"IF(B9=\"\",\"\",DATABASE!C19)","v":"หจก. ธงชัย โอเอ เซลส์แอนเซอร์วิส"},{"$f":"IF(B9=\"\",\"\",แนบท้ายรายงาน!I6)","v":6390},null,{"$f":"IF(H9=\"\",\"\",H9)","v":6390},null,{"$f":"IF(แนบท้ายรายงาน!J6=\"\",\"\",\"เลือกก่อนปริ้น\")","v":"เลือกก่อนปริ้น"}]
[null,{"$f":"IF(แนบท้ายรายงาน!B7=\"\",\"\",แนบท้ายรายงาน!B7&\".\"&\" \"&แนบท้ายรายงาน!C7&\" จำนวน \"&แนบท้ายรายงาน!D7&\" \"&แนบท้ายรายงาน!E7)","v":""},null,null,null,null,{"$f":"IF(B10=\"\",\"\",$G$9)","v":""},{"$f":"IF(B10=\"\",\"\",แนบท้ายรายงาน!I7)","v":""},null,{"$f":"IF(H10=\"\",\"\",H10)","v":""},null,{"$f":"IF(แนบท้ายรายงาน!J7=\"\",\"\",\"เลือกก่อนปริ้น\")","v":""}]
[null,{"$f":"IF(แนบท้ายรายงาน!B8=\"\",\"\",แนบท้ายรายงาน!B8&\".\"&\" \"&แนบท้ายรายงาน!C8&\" จำนวน \"&แนบท้ายรายงาน!D8&\" \"&แนบท้ายรายงาน!E8)","v":""},null,null,null,null,{"$f":"IF(B11=\"\",\"\",$G$9)","v":""},{"$f":"IF(B11=\"\",\"\",แนบท้ายรายงาน!I8)","v":""},null,{"$f":"IF(H11=\"\",\"\",H11)","v":""},null,{"$f":"IF(แนบท้ายรายงาน!J8=\"\",\"\",\"เลือกก่อนปริ้น\")","v":""}]
[null,{"$f":"IF(แนบท้ายรายงาน!B9=\"\",\"\",แนบท้ายรายงาน!B9&\".\"&\" \"&แนบท้ายรายงาน!C9&\" จำนวน \"&แนบท้ายรายงาน!D9&\" \"&แนบท้ายรายงาน!E9)","v":""},null,null,null,null,"",{"$f":"IF(B12=\"\",\"\",แนบท้ายรายงาน!I9)","v":""},null,{"$f":"IF(H12=\"\",\"\",H12)","v":""},null,{"$f":"IF(แนบท้ายรายงาน!J9=\"\",\"\",\"เลือกก่อนปริ้น\")","v":""}]
[null,{"$f":"IF(แนบท้ายรายงาน!B10=\"\",\"\",แนบท้ายรายงาน!B10&\".\"&\" \"&แนบท้ายรายงาน!C10&\" จำนวน \"&แนบท้ายรายงาน!D10&\" \"&แนบท้ายรายงาน!E10)","v":""},null,null,null,null,"",{"$f":"IF(B13=\"\",\"\",แนบท้ายรายงาน!I10)","v":""},null,{"$f":"IF(H13=\"\",\"\",H13)","v":""},null,{"$f":"IF(แนบท้ายรายงาน!J10=\"\",\"\",\"เลือกก่อนปริ้น\")","v":""}]
[null,{"$f":"IF(แนบท้ายรายงาน!B11=\"\",\"\",แนบท้ายรายงาน!B11&\".\"&\" \"&แนบท้ายรายงาน!C11&\" จำนวน \"&แนบท้ายรายงาน!D11&\" \"&แนบท้ายรายงาน!E11)","v":""},null,null,null,null,"",{"$f":"IF(B14=\"\",\"\",แนบท้ายรายงาน!I11)","v":""},null,{"$f":"IF(H14=\"\",\"\",H14)","v":""},null,{"$f":"IF(แนบท้ายรายงาน!J11=\"\",\"\",\"เลือกก่อนปริ้น\")","v":""}]
[null,{"$f":"IF(แนบท้ายรายงาน!B12=\"\",\"\",แนบท้ายรายงาน!B12&\".\"&\" \"&แนบท้ายรายงาน!C12&\" จำนวน \"&แนบท้ายรายงาน!D12&\" \"&แนบท้ายรายงาน!E12)","v":""},null,null,null,null,"",{"$f":"IF(B15=\"\",\"\",แนบท้ายรายงาน!I12)","v":""},null,"",null,{"$f":"IF(แนบท้ายรายงาน!J12=\"\",\"\",\"เลือกก่อนปริ้น\")","v":""}]
[null,{"$f":"IF(แนบท้ายรายงาน!B13=\"\",\"\",แนบท้ายรายงาน!B13&\".\"&\" \"&แนบท้ายรายงาน!C13&\" จำนวน \"&แนบท้ายรายงาน!D13&\" \"&แนบท้ายรายงาน!E13)","v":""},null,null,null,null,"",{"$f":"IF(B16=\"\",\"\",แนบท้ายรายงาน!I13)","v":""},null,"",null,{"$f":"IF(แนบท้ายรายงาน!J13=\"\",\"\",\"เลือกก่อนปริ้น\")","v":""}]
[null,{"$f":"IF(แนบท้ายรายงาน!B14=\"\",\"\",แนบท้ายรายงาน!B14&\".\"&\" \"&แนบท้ายรายงาน!C14&\" จำนวน \"&แนบท้ายรายงาน!D14&\" \"&แนบท้ายรายงาน!E14)","v":""},null,null,null,null,"",{"$f":"IF(B17=\"\",\"\",แนบท้ายรายงาน!I14)","v":""},null,"",null,{"$f":"IF(แนบท้ายรายงาน!J14=\"\",\"\",\"เลือกก่อนปริ้น\")","v":""}]
[null,{"$f":"IF(แนบท้ายรายงาน!B15=\"\",\"\",แนบท้ายรายงาน!B15&\".\"&\" \"&แนบท้ายรายงาน!C15&\" จำนวน \"&แนบท้ายรายงาน!D15&\" \"&แนบท้ายรายงาน!E15)","v":""},null,null,null,null,"",{"$f":"IF(B18=\"\",\"\",แนบท้ายรายงาน!I15)","v":""},null,"",null,{"$f":"IF(แนบท้ายรายงาน!J15=\"\",\"\",\"เลือกก่อนปริ้น\")","v":""}]
[null,{"$f":"IF(แนบท้ายรายงาน!B16=\"\",\"\",แนบท้ายรายงาน!B16&\".\"&\" \"&แนบท้ายรายงาน!C16&\" จำนวน \"&แนบท้ายรายงาน!D16&\" \"&แนบท้ายรายงาน!E16)","v":""},null,null,null,null,"",{"$f":"IF(B19=\"\",\"\",แนบท้ายรายงาน!I16)","v":""},null,"",null,{"$f":"IF(แนบท้ายรายงาน!J16=\"\",\"\",\"เลือกก่อนปริ้น\")","v":""}]
[null,{"$f":"IF(แนบท้ายรายงาน!B17=\"\",\"\",แนบท้ายรายงาน!B17&\".\"&\" \"&แนบท้ายรายงาน!C17&\" จำนวน \"&แนบท้ายรายงาน!D17&\" \"&แนบท้ายรายงาน!E17)","v":""},null,null,null,null,"",{"$f":"IF(B20=\"\",\"\",แนบท้ายรายงาน!I17)","v":""},null,{"$f":"IF(H20=\"\",\"\",H20)","v":""},null,{"$f":"IF(แนบท้ายรายงาน!J17=\"\",\"\",\"เลือกก่อนปริ้น\")","v":""}]
[null,{"$f":"IF(แนบท้ายรายงาน!B18=\"\",\"\",แนบท้ายรายงาน!B18&\".\"&\" \"&แนบท้ายรายงาน!C18&\" จำนวน \"&แนบท้ายรายงาน!D18&\" \"&แนบท้ายรายงาน!E18)","v":""},null,null,null,null,"",{"$f":"IF(B21=\"\",\"\",แนบท้ายรายงาน!I18)","v":""},null,"",null,{"$f":"IF(แนบท้ายรายงาน!J18=\"\",\"\",\"เลือกก่อนปริ้น\")","v":""}]
[null,{"$f":"IF(แนบท้ายรายงาน!B19=\"\",\"\",แนบท้ายรายงาน!B19&\".\"&\" \"&แนบท้ายรายงาน!C19&\" จำนวน \"&แนบท้ายรายงาน!D19&\" \"&แนบท้ายรายงาน!E19)","v":""},null,null,null,null,"",{"$f":"IF(B22=\"\",\"\",แนบท้ายรายงาน!I19)","v":""},null,"",null,{"$f":"IF(แนบท้ายรายงาน!J19=\"\",\"\",\"เลือกก่อนปริ้น\")","v":""}]
[null,{"$f":"IF(แนบท้ายรายงาน!B20=\"\",\"\",แนบท้ายรายงาน!B20&\".\"&\" \"&แนบท้ายรายงาน!C20&\" จำนวน \"&แนบท้ายรายงาน!D20&\" \"&แนบท้ายรายงาน!E20)","v":""},null,null,null,null,"",{"$f":"IF(B23=\"\",\"\",แนบท้ายรายงาน!I20)","v":""},null,"",null,{"$f":"IF(แนบท้ายรายงาน!J20=\"\",\"\",\"เลือกก่อนปริ้น\")","v":""}]
[null,{"$f":"IF(แนบท้ายรายงาน!B21=\"\",\"\",แนบท้ายรายงาน!B21&\".\"&\" \"&แนบท้ายรายงาน!C21&\" จำนวน \"&แนบท้ายรายงาน!D21&\" \"&แนบท้ายรายงาน!E21)","v":""},null,null,null,null,"",{"$f":"IF(B24=\"\",\"\",แนบท้ายรายงาน!I21)","v":""},null,"",null,{"$f":"IF(แนบท้ายรายงาน!J21=\"\",\"\",\"เลือกก่อนปริ้น\")","v":""}]
[null,{"$f":"IF(แนบท้ายรายงาน!B22=\"\",\"\",แนบท้ายรายงาน!B22&\".\"&\" \"&แนบท้ายรายงาน!C22&\" จำนวน \"&แนบท้ายรายงาน!D22&\" \"&แนบท้ายรายงาน!E22)","v":""},null,null,null,null,"",{"$f":"IF(B25=\"\",\"\",แนบท้ายรายงาน!I22)","v":""},null,"",null,{"$f":"IF(แนบท้ายรายงาน!J22=\"\",\"\",\"เลือกก่อนปริ้น\")","v":""}]
[null,{"$f":"IF(แนบท้ายรายงาน!B23=\"\",\"\",แนบท้ายรายงาน!B23&\".\"&\" \"&แนบท้ายรายงาน!C23&\" จำนวน \"&แนบท้ายรายงาน!D23&\" \"&แนบท้ายรายงาน!E23)","v":""},null,null,null,null,"",{"$f":"IF(B26=\"\",\"\",แนบท้ายรายงาน!I23)","v":""},null,"",null,{"$f":"IF(แนบท้ายรายงาน!J23=\"\",\"\",\"เลือกก่อนปริ้น\")","v":""}]
[null,{"$f":"IF(แนบท้ายรายงาน!B24=\"\",\"\",แนบท้ายรายงาน!B24&\".\"&\" \"&แนบท้ายรายงาน!C24&\" จำนวน \"&แนบท้ายรายงาน!D24&\" \"&แนบท้ายรายงาน!E24)","v":""},null,null,null,null,"",{"$f":"IF(B27=\"\",\"\",แนบท้ายรายงาน!I24)","v":""},null,"",null,{"$f":"IF(แนบท้ายรายงาน!J24=\"\",\"\",\"เลือกก่อนปริ้น\")","v":""}]
[null,{"$f":"IF(แนบท้ายรายงาน!B25=\"\",\"\",แนบท้ายรายงาน!B25&\".\"&\" \"&แนบท้ายรายงาน!C25&\" จำนวน \"&แนบท้ายรายงาน!D25&\" \"&แนบท้ายรายงาน!E25)","v":""},null,null,null,null,"",{"$f":"IF(B28=\"\",\"\",แนบท้ายรายงาน!I25)","v":""},null,"",null,{"$f":"IF(แนบท้ายรายงาน!J25=\"\",\"\",\"เลือกก่อนปริ้น\")","v":""}]
[null,{"$f":"IF(แนบท้ายรายงาน!B26=\"\",\"\",แนบท้ายรายงาน!B26&\".\"&\" \"&แนบท้ายรายงาน!C26&\" จำนวน \"&แนบท้ายรายงาน!D26&\" \"&แนบท้ายรายงาน!E26)","v":""},null,null,null,null,"",{"$f":"IF(B29=\"\",\"\",แนบท้ายรายงาน!I26)","v":""},null,"",null,{"$f":"IF(แนบท้ายรายงาน!J26=\"\",\"\",\"เลือกก่อนปริ้น\")","v":""}]
[null,{"$f":"IF(แนบท้ายรายงาน!B27=\"\",\"\",แนบท้ายรายงาน!B27&\".\"&\" \"&แนบท้ายรายงาน!C27&\" จำนวน \"&แนบท้ายรายงาน!D27&\" \"&แนบท้ายรายงาน!E27)","v":""},null,null,null,null,"",{"$f":"IF(B30=\"\",\"\",แนบท้ายรายงาน!I27)","v":""},null,"",null,{"$f":"IF(แนบท้ายรายงาน!J27=\"\",\"\",\"เลือกก่อนปริ้น\")","v":""}]
[null,{"$f":"IF(แนบท้ายรายงาน!B28=\"\",\"\",แนบท้ายรายงาน!B28&\".\"&\" \"&แนบท้ายรายงาน!C28&\" จำนวน \"&แนบท้ายรายงาน!D28&\" \"&แนบท้ายรายงาน!E28)","v":""},null,null,null,null,"",{"$f":"IF(B31=\"\",\"\",แนบท้ายรายงาน!I28)","v":""},null,"",null,{"$f":"IF(แนบท้ายรายงาน!J28=\"\",\"\",\"เลือกก่อนปริ้น\")","v":""}]
[null,{"$f":"IF(แนบท้ายรายงาน!B29=\"\",\"\",แนบท้ายรายงาน!B29&\".\"&\" \"&แนบท้ายรายงาน!C29&\" จำนวน \"&แนบท้ายรายงาน!D29&\" \"&แนบท้ายรายงาน!E29)","v":""},null,null,null,null,"",{"$f":"IF(B32=\"\",\"\",แนบท้ายรายงาน!I29)","v":""},null,"",null,{"$f":"IF(แนบท้ายรายงาน!J29=\"\",\"\",\"เลือกก่อนปริ้น\")","v":""}]
[null,{"$f":"IF(แนบท้ายรายงาน!B30=\"\",\"\",แนบท้ายรายงาน!B30&\".\"&\" \"&แนบท้ายรายงาน!C30&\" จำนวน \"&แนบท้ายรายงาน!D30&\" \"&แนบท้ายรายงาน!E30)","v":""},null,null,null,null,"",{"$f":"IF(B33=\"\",\"\",แนบท้ายรายงาน!I30)","v":""},null,"",null,{"$f":"IF(แนบท้ายรายงาน!J30=\"\",\"\",\"เลือกก่อนปริ้น\")","v":""}]
[null,{"$f":"IF(แนบท้ายรายงาน!B31=\"\",\"\",แนบท้ายรายงาน!B31&\".\"&\" \"&แนบท้ายรายงาน!C31&\" จำนวน \"&แนบท้ายรายงาน!D31&\" \"&แนบท้ายรายงาน!E31)","v":""},null,null,null,null,"",{"$f":"IF(B34=\"\",\"\",แนบท้ายรายงาน!I31)","v":""},null,"",null,{"$f":"IF(แนบท้ายรายงาน!J31=\"\",\"\",\"เลือกก่อนปริ้น\")","v":""}]
[null,{"$f":"IF(แนบท้ายรายงาน!B32=\"\",\"\",แนบท้ายรายงาน!B32&\".\"&\" \"&แนบท้ายรายงาน!C32&\" จำนวน \"&แนบท้ายรายงาน!D32&\" \"&แนบท้ายรายงาน!E32)","v":""},null,null,null,null,"",{"$f":"IF(B35=\"\",\"\",แนบท้ายรายงาน!I32)","v":""},null,"",null,{"$f":"IF(แนบท้ายรายงาน!J32=\"\",\"\",\"เลือกก่อนปริ้น\")","v":""}]
[null,{"$f":"IF(แนบท้ายรายงาน!B33=\"\",\"\",แนบท้ายรายงาน!B33&\".\"&\" \"&แนบท้ายรายงาน!C33&\" จำนวน \"&แนบท้ายรายงาน!D33&\" \"&แนบท้ายรายงาน!E33)","v":""},null,null,null,null,"",{"$f":"IF(B36=\"\",\"\",แนบท้ายรายงาน!I33)","v":""},null,"",null,{"$f":"IF(แนบท้ายรายงาน!J33=\"\",\"\",\"เลือกก่อนปริ้น\")","v":""}]
[null,{"$f":"IF(แนบท้ายรายงาน!B34=\"\",\"\",แนบท้ายรายงาน!B34&\".\"&\" \"&แนบท้ายรายงาน!C34&\" จำนวน \"&แนบท้ายรายงาน!D34&\" \"&แนบท้ายรายงาน!E34)","v":""},null,null,null,null,"",{"$f":"IF(B37=\"\",\"\",แนบท้ายรายงาน!I34)","v":""},null,"",null,{"$f":"IF(แนบท้ายรายงาน!J34=\"\",\"\",\"เลือกก่อนปริ้น\")","v":""}]
[null,{"$f":"IF(แนบท้ายรายงาน!B35=\"\",\"\",แนบท้ายรายงาน!B35&\".\"&\" \"&แนบท้ายรายงาน!C35&\" จำนวน \"&แนบท้ายรายงาน!D35&\" \"&แนบท้ายรายงาน!E35)","v":""},null,null,null,null,"",{"$f":"IF(B38=\"\",\"\",แนบท้ายรายงาน!I35)","v":""},null,"",null,{"$f":"IF(แนบท้ายรายงาน!J35=\"\",\"\",\"เลือกก่อนปริ้น\")","v":""}]
[null,{"$f":"IF(แนบท้ายรายงาน!B36=\"\",\"\",แนบท้ายรายงาน!B36&\".\"&\" \"&แนบท้ายรายงาน!C36&\" จำนวน \"&แนบท้ายรายงาน!D36&\" \"&แนบท้ายรายงาน!E36)","v":""},null,null,null,null,"",{"$f":"IF(B39=\"\",\"\",แนบท้ายรายงาน!I36)","v":""},null,"",null,{"$f":"IF(แนบท้ายรายงาน!J36=\"\",\"\",\"เลือกก่อนปริ้น\")","v":""}]
[null,{"$f":"IF(แนบท้ายรายงาน!B37=\"\",\"\",แนบท้ายรายงาน!B37&\".\"&\" \"&แนบท้ายรายงาน!C37&\" จำนวน \"&แนบท้ายรายงาน!D37&\" \"&แนบท้ายรายงาน!E37)","v":""},null,null,null,null,"",{"$f":"IF(B40=\"\",\"\",แนบท้ายรายงาน!I37)","v":""},null,"",null,{"$f":"IF(แนบท้ายรายงาน!J37=\"\",\"\",\"เลือกก่อนปริ้น\")","v":""}]
[null,{"$f":"IF(แนบท้ายรายงาน!B38=\"\",\"\",แนบท้ายรายงาน!B38&\".\"&\" \"&แนบท้ายรายงาน!C38&\" จำนวน \"&แนบท้ายรายงาน!D38&\" \"&แนบท้ายรายงาน!E38)","v":""},null,null,null,null,"",{"$f":"IF(B41=\"\",\"\",แนบท้ายรายงาน!I38)","v":""},null,"",null,{"$f":"IF(แนบท้ายรายงาน!J38=\"\",\"\",\"เลือกก่อนปริ้น\")","v":""}]
[null,{"$f":"IF(แนบท้ายรายงาน!B39=\"\",\"\",แนบท้ายรายงาน!B39&\".\"&\" \"&แนบท้ายรายงาน!C39&\" จำนวน \"&แนบท้ายรายงาน!D39&\" \"&แนบท้ายรายงาน!E39)","v":""},null,null,null,null,"",{"$f":"IF(B42=\"\",\"\",แนบท้ายรายงาน!I39)","v":""},null,"",null,{"$f":"IF(แนบท้ายรายงาน!J39=\"\",\"\",\"เลือกก่อนปริ้น\")","v":""}]
[null,{"$f":"IF(แนบท้ายรายงาน!B40=\"\",\"\",แนบท้ายรายงาน!B40&\".\"&\" \"&แนบท้ายรายงาน!C40&\" จำนวน \"&แนบท้ายรายงาน!D40&\" \"&แนบท้ายรายงาน!E40)","v":""},null,null,null,null,"",{"$f":"IF(B43=\"\",\"\",แนบท้ายรายงาน!I40)","v":""},null,"",null,{"$f":"IF(แนบท้ายรายงาน!J40=\"\",\"\",\"เลือกก่อนปริ้น\")","v":""}]
[null,{"$f":"IF(แนบท้ายรายงาน!B41=\"\",\"\",แนบท้ายรายงาน!B41&\".\"&\" \"&แนบท้ายรายงาน!C41&\" จำนวน \"&แนบท้ายรายงาน!D41&\" \"&แนบท้ายรายงาน!E41)","v":""},null,null,null,null,"",{"$f":"IF(B44=\"\",\"\",แนบท้ายรายงาน!I41)","v":""},null,"",null,{"$f":"IF(แนบท้ายรายงาน!J41=\"\",\"\",\"เลือกก่อนปริ้น\")","v":""}]
[null,{"$f":"IF(แนบท้ายรายงาน!B42=\"\",\"\",แนบท้ายรายงาน!B42&\".\"&\" \"&แนบท้ายรายงาน!C42&\" จำนวน \"&แนบท้ายรายงาน!D42&\" \"&แนบท้ายรายงาน!E42)","v":""},null,null,null,null,"",{"$f":"IF(B45=\"\",\"\",แนบท้ายรายงาน!I42)","v":""},null,"",null,{"$f":"IF(แนบท้ายรายงาน!J42=\"\",\"\",\"เลือกก่อนปริ้น\")","v":""}]
[null,{"$f":"IF(แนบท้ายรายงาน!B43=\"\",\"\",แนบท้ายรายงาน!B43&\".\"&\" \"&แนบท้ายรายงาน!C43&\" จำนวน \"&แนบท้ายรายงาน!D43&\" \"&แนบท้ายรายงาน!E43)","v":""},null,null,null,null,"",{"$f":"IF(B46=\"\",\"\",แนบท้ายรายงาน!I43)","v":""},null,"",null,{"$f":"IF(แนบท้ายรายงาน!J43=\"\",\"\",\"เลือกก่อนปริ้น\")","v":""}]
[null,{"$f":"IF(แนบท้ายรายงาน!B44=\"\",\"\",แนบท้ายรายงาน!B44&\".\"&\" \"&แนบท้ายรายงาน!C44&\" จำนวน \"&แนบท้ายรายงาน!D44&\" \"&แนบท้ายรายงาน!E44)","v":""},null,null,null,null,"",{"$f":"IF(B47=\"\",\"\",แนบท้ายรายงาน!I44)","v":""},null,"",null,{"$f":"IF(แนบท้ายรายงาน!J44=\"\",\"\",\"เลือกก่อนปริ้น\")","v":""}]
[null,{"$f":"IF(แนบท้ายรายงาน!B45=\"\",\"\",แนบท้ายรายงาน!B45&\".\"&\" \"&แนบท้ายรายงาน!C45&\" จำนวน \"&แนบท้ายรายงาน!D45&\" \"&แนบท้ายรายงาน!E45)","v":""},null,null,null,null,"",{"$f":"IF(B48=\"\",\"\",แนบท้ายรายงาน!I45)","v":""},null,"",null,{"$f":"IF(แนบท้ายรายงาน!J45=\"\",\"\",\"เลือกก่อนปริ้น\")","v":""}]
[null,{"$f":"IF(แนบท้ายรายงาน!B46=\"\",\"\",แนบท้ายรายงาน!B46&\".\"&\" \"&แนบท้ายรายงาน!C46&\" จำนวน \"&แนบท้ายรายงาน!D46&\" \"&แนบท้ายรายงาน!E46)","v":""},null,null,null,null,"",{"$f":"IF(B49=\"\",\"\",แนบท้ายรายงาน!I46)","v":""},null,"",null,{"$f":"IF(แนบท้ายรายงาน!J46=\"\",\"\",\"เลือกก่อนปริ้น\")","v":""}]
[null,{"$f":"IF(แนบท้ายรายงาน!B47=\"\",\"\",แนบท้ายรายงาน!B47&\".\"&\" \"&แนบท้ายรายงาน!C47&\" จำนวน \"&แนบท้ายรายงาน!D47&\" \"&แนบท้ายรายงาน!E47)","v":""},null,null,null,null,"",{"$f":"IF(B50=\"\",\"\",แนบท้ายรายงาน!I47)","v":""},null,"",null,{"$f":"IF(แนบท้ายรายงาน!J47=\"\",\"\",\"เลือกก่อนปริ้น\")","v":""}]
[null,{"$f":"IF(แนบท้ายรายงาน!B48=\"\",\"\",แนบท้ายรายงาน!B48&\".\"&\" \"&แนบท้ายรายงาน!C48&\" จำนวน \"&แนบท้ายรายงาน!D48&\" \"&แนบท้ายรายงาน!E48)","v":""},null,null,null,null,"",{"$f":"IF(B51=\"\",\"\",แนบท้ายรายงาน!I48)","v":""},null,"",null,{"$f":"IF(แนบท้ายรายงาน!J48=\"\",\"\",\"เลือกก่อนปริ้น\")","v":""}]
[null,{"$f":"IF(แนบท้ายรายงาน!B49=\"\",\"\",แนบท้ายรายงาน!B49&\".\"&\" \"&แนบท้ายรายงาน!C49&\" จำนวน \"&แนบท้ายรายงาน!D49&\" \"&แนบท้ายรายงาน!E49)","v":""},null,null,null,null,"",{"$f":"IF(B52=\"\",\"\",แนบท้ายรายงาน!I49)","v":""},null,"",null,{"$f":"IF(แนบท้ายรายงาน!J49=\"\",\"\",\"เลือกก่อนปริ้น\")","v":""}]
[null,{"$f":"IF(แนบท้ายรายงาน!B50=\"\",\"\",แนบท้ายรายงาน!B50&\".\"&\" \"&แนบท้ายรายงาน!C50&\" จำนวน \"&แนบท้ายรายงาน!D50&\" \"&แนบท้ายรายงาน!E50)","v":""},null,null,null,null,"",{"$f":"IF(B53=\"\",\"\",แนบท้ายรายงาน!I50)","v":""},null,"",null,{"$f":"IF(แนบท้ายรายงาน!J50=\"\",\"\",\"เลือกก่อนปริ้น\")","v":""}]
[null,{"$f":"IF(แนบท้ายรายงาน!B51=\"\",\"\",แนบท้ายรายงาน!B51&\".\"&\" \"&แนบท้ายรายงาน!C51&\" จำนวน \"&แนบท้ายรายงาน!D51&\" \"&แนบท้ายรายงาน!E51)","v":""},null,null,null,null,"",{"$f":"IF(B54=\"\",\"\",แนบท้ายรายงาน!I51)","v":""},null,"",null,{"$f":"IF(แนบท้ายรายงาน!J51=\"\",\"\",\"เลือกก่อนปริ้น\")","v":""}]
[null,{"$f":"IF(แนบท้ายรายงาน!B52=\"\",\"\",แนบท้ายรายงาน!B52&\".\"&\" \"&แนบท้ายรายงาน!C52&\" จำนวน \"&แนบท้ายรายงาน!D52&\" \"&แนบท้ายรายงาน!E52)","v":""},null,null,null,null,"",{"$f":"IF(B55=\"\",\"\",แนบท้ายรายงาน!I52)","v":""},null,"",null,{"$f":"IF(แนบท้ายรายงาน!J52=\"\",\"\",\"เลือกก่อนปริ้น\")","v":""}]
[null,{"$f":"IF(แนบท้ายรายงาน!B53=\"\",\"\",แนบท้ายรายงาน!B53&\".\"&\" \"&แนบท้ายรายงาน!C53&\" จำนวน \"&แนบท้ายรายงาน!D53&\" \"&แนบท้ายรายงาน!E53)","v":""},null,null,null,null,"",{"$f":"IF(B56=\"\",\"\",แนบท้ายรายงาน!I53)","v":""},null,"",null,{"$f":"IF(แนบท้ายรายงาน!J53=\"\",\"\",\"เลือกก่อนปริ้น\")","v":""}]
[null,{"$f":"IF(แนบท้ายรายงาน!B54=\"\",\"\",แนบท้ายรายงาน!B54&\".\"&\" \"&แนบท้ายรายงาน!C54&\" จำนวน \"&แนบท้ายรายงาน!D54&\" \"&แนบท้ายรายงาน!E54)","v":""},null,null,null,null,"",{"$f":"IF(B57=\"\",\"\",แนบท้ายรายงาน!I54)","v":""},null,"",null,{"$f":"IF(แนบท้ายรายงาน!J54=\"\",\"\",\"เลือกก่อนปริ้น\")","v":""}]
[null,{"$f":"IF(แนบท้ายรายงาน!B55=\"\",\"\",แนบท้ายรายงาน!B55&\".\"&\" \"&แนบท้ายรายงาน!C55&\" จำนวน \"&แนบท้ายรายงาน!D55&\" \"&แนบท้ายรายงาน!E55)","v":""},null,null,null,null,"",{"$f":"IF(B58=\"\",\"\",แนบท้ายรายงาน!I55)","v":""},null,"",null,{"$f":"IF(แนบท้ายรายงาน!J55=\"\",\"\",\"เลือกก่อนปริ้น\")","v":""}]
[null,{"$f":"IF(แนบท้ายรายงาน!B56=\"\",\"\",แนบท้ายรายงาน!B56&\".\"&\" \"&แนบท้ายรายงาน!C56&\" จำนวน \"&แนบท้ายรายงาน!D56&\" \"&แนบท้ายรายงาน!E56)","v":""},null,null,null,null,"",{"$f":"IF(B59=\"\",\"\",แนบท้ายรายงาน!I56)","v":""},null,"",null,{"$f":"IF(แนบท้ายรายงาน!J56=\"\",\"\",\"เลือกก่อนปริ้น\")","v":""}]
[null,{"$f":"IF(แนบท้ายรายงาน!B57=\"\",\"\",แนบท้ายรายงาน!B57&\".\"&\" \"&แนบท้ายรายงาน!C57&\" จำนวน \"&แนบท้ายรายงาน!D57&\" \"&แนบท้ายรายงาน!E57)","v":""},null,null,null,null,"",{"$f":"IF(B60=\"\",\"\",แนบท้ายรายงาน!I57)","v":""},null,"",null,{"$f":"IF(แนบท้ายรายงาน!J57=\"\",\"\",\"เลือกก่อนปริ้น\")","v":""}]
[null,{"$f":"IF(แนบท้ายรายงาน!B58=\"\",\"\",แนบท้ายรายงาน!B58&\".\"&\" \"&แนบท้ายรายงาน!C58&\" จำนวน \"&แนบท้ายรายงาน!D58&\" \"&แนบท้ายรายงาน!E58)","v":""},null,null,null,null,"",{"$f":"IF(B61=\"\",\"\",แนบท้ายรายงาน!I58)","v":""},null,"",null,{"$f":"IF(แนบท้ายรายงาน!J58=\"\",\"\",\"เลือกก่อนปริ้น\")","v":""}]
[null,{"$f":"IF(แนบท้ายรายงาน!B59=\"\",\"\",แนบท้ายรายงาน!B59&\".\"&\" \"&แนบท้ายรายงาน!C59&\" จำนวน \"&แนบท้ายรายงาน!D59&\" \"&แนบท้ายรายงาน!E59)","v":""},null,null,null,null,"",{"$f":"IF(B62=\"\",\"\",แนบท้ายรายงาน!I59)","v":""},null,"",null,{"$f":"IF(แนบท้ายรายงาน!J59=\"\",\"\",\"เลือกก่อนปริ้น\")","v":""}]
[null,{"$f":"IF(แนบท้ายรายงาน!B60=\"\",\"\",แนบท้ายรายงาน!B60&\".\"&\" \"&แนบท้ายรายงาน!C60&\" จำนวน \"&แนบท้ายรายงาน!D60&\" \"&แนบท้ายรายงาน!E60)","v":""},null,null,null,null,"",{"$f":"IF(B63=\"\",\"\",แนบท้ายรายงาน!I60)","v":""},null,"",null,{"$f":"IF(แนบท้ายรายงาน!J60=\"\",\"\",\"เลือกก่อนปริ้น\")","v":""}]
[null,{"$f":"IF(แนบท้ายรายงาน!B61=\"\",\"\",แนบท้ายรายงาน!B61&\".\"&\" \"&แนบท้ายรายงาน!C61&\" จำนวน \"&แนบท้ายรายงาน!D61&\" \"&แนบท้ายรายงาน!E61)","v":""},null,null,null,null,"",{"$f":"IF(B64=\"\",\"\",แนบท้ายรายงาน!I61)","v":""},null,"",null,{"$f":"IF(แนบท้ายรายงาน!J61=\"\",\"\",\"เลือกก่อนปริ้น\")","v":""}]
[null,{"$f":"IF(แนบท้ายรายงาน!B62=\"\",\"\",แนบท้ายรายงาน!B62&\".\"&\" \"&แนบท้ายรายงาน!C62&\" จำนวน \"&แนบท้ายรายงาน!D62&\" \"&แนบท้ายรายงาน!E62)","v":""},null,null,null,null,"",{"$f":"IF(B65=\"\",\"\",แนบท้ายรายงาน!I62)","v":""},null,"",null,{"$f":"IF(แนบท้ายรายงาน!J62=\"\",\"\",\"เลือกก่อนปริ้น\")","v":""}]
[null,{"$f":"IF(แนบท้ายรายงาน!B63=\"\",\"\",แนบท้ายรายงาน!B63&\".\"&\" \"&แนบท้ายรายงาน!C63&\" จำนวน \"&แนบท้ายรายงาน!D63&\" \"&แนบท้ายรายงาน!E63)","v":""},null,null,null,null,"",{"$f":"IF(B66=\"\",\"\",แนบท้ายรายงาน!I63)","v":""},null,"",null,{"$f":"IF(แนบท้ายรายงาน!J63=\"\",\"\",\"เลือกก่อนปริ้น\")","v":""}]
[null,{"$f":"IF(แนบท้ายรายงาน!B64=\"\",\"\",แนบท้ายรายงาน!B64&\".\"&\" \"&แนบท้ายรายงาน!C64&\" จำนวน \"&แนบท้ายรายงาน!D64&\" \"&แนบท้ายรายงาน!E64)","v":""},null,null,null,null,"",{"$f":"IF(B67=\"\",\"\",แนบท้ายรายงาน!I64)","v":""},null,"",null,{"$f":"IF(แนบท้ายรายงาน!J64=\"\",\"\",\"เลือกก่อนปริ้น\")","v":""}]
[null,{"$f":"IF(แนบท้ายรายงาน!B65=\"\",\"\",แนบท้ายรายงาน!B65&\".\"&\" \"&แนบท้ายรายงาน!C65&\" จำนวน \"&แนบท้ายรายงาน!D65&\" \"&แนบท้ายรายงาน!E65)","v":""},null,null,null,null,"",{"$f":"IF(B68=\"\",\"\",แนบท้ายรายงาน!I65)","v":""},null,"",null,{"$f":"IF(แนบท้ายรายงาน!J65=\"\",\"\",\"เลือกก่อนปริ้น\")","v":""}]
[null,{"$f":"IF(แนบท้ายรายงาน!B66=\"\",\"\",แนบท้ายรายงาน!B66&\".\"&\" \"&แนบท้ายรายงาน!C66&\" จำนวน \"&แนบท้ายรายงาน!D66&\" \"&แนบท้ายรายงาน!E66)","v":""},null,null,null,null,"",{"$f":"IF(B69=\"\",\"\",แนบท้ายรายงาน!I66)","v":""},null,"",null,{"$f":"IF(แนบท้ายรายงาน!J66=\"\",\"\",\"เลือกก่อนปริ้น\")","v":""}]
[null,{"$f":"IF(แนบท้ายรายงาน!B67=\"\",\"\",แนบท้ายรายงาน!B67&\".\"&\" \"&แนบท้ายรายงาน!C67&\" จำนวน \"&แนบท้ายรายงาน!D67&\" \"&แนบท้ายรายงาน!E67)","v":""},null,null,null,null,"",{"$f":"IF(B70=\"\",\"\",แนบท้ายรายงาน!I67)","v":""},null,"",null,{"$f":"IF(แนบท้ายรายงาน!J67=\"\",\"\",\"เลือกก่อนปริ้น\")","v":""}]
[null,{"$f":"IF(แนบท้ายรายงาน!B68=\"\",\"\",แนบท้ายรายงาน!B68&\".\"&\" \"&แนบท้ายรายงาน!C68&\" จำนวน \"&แนบท้ายรายงาน!D68&\" \"&แนบท้ายรายงาน!E68)","v":""},null,null,null,null,"",{"$f":"IF(B71=\"\",\"\",แนบท้ายรายงาน!I68)","v":""},null,"",null,{"$f":"IF(แนบท้ายรายงาน!J68=\"\",\"\",\"เลือกก่อนปริ้น\")","v":""}]
[null,{"$f":"IF(แนบท้ายรายงาน!B69=\"\",\"\",แนบท้ายรายงาน!B69&\".\"&\" \"&แนบท้ายรายงาน!C69&\" จำนวน \"&แนบท้ายรายงาน!D69&\" \"&แนบท้ายรายงาน!E69)","v":""},null,null,null,null,"",{"$f":"IF(B72=\"\",\"\",แนบท้ายรายงาน!I69)","v":""},null,"",null,{"$f":"IF(แนบท้ายรายงาน!J69=\"\",\"\",\"เลือกก่อนปริ้น\")","v":""}]
[null,{"$f":"IF(แนบท้ายรายงาน!B70=\"\",\"\",แนบท้ายรายงาน!B70&\".\"&\" \"&แนบท้ายรายงาน!C70&\" จำนวน \"&แนบท้ายรายงาน!D70&\" \"&แนบท้ายรายงาน!E70)","v":""},null,null,null,null,"",{"$f":"IF(B73=\"\",\"\",แนบท้ายรายงาน!I70)","v":""},null,"",null,{"$f":"IF(แนบท้ายรายงาน!J70=\"\",\"\",\"เลือกก่อนปริ้น\")","v":""}]
[null,{"$f":"IF(แนบท้ายรายงาน!B71=\"\",\"\",แนบท้ายรายงาน!B71&\".\"&\" \"&แนบท้ายรายงาน!C71&\" จำนวน \"&แนบท้ายรายงาน!D71&\" \"&แนบท้ายรายงาน!E71)","v":""},null,null,null,null,"",{"$f":"IF(B74=\"\",\"\",แนบท้ายรายงาน!I71)","v":""},null,"",null,{"$f":"IF(แนบท้ายรายงาน!J71=\"\",\"\",\"เลือกก่อนปริ้น\")","v":""}]
[null,{"$f":"IF(แนบท้ายรายงาน!B72=\"\",\"\",แนบท้ายรายงาน!B72&\".\"&\" \"&แนบท้ายรายงาน!C72&\" จำนวน \"&แนบท้ายรายงาน!D72&\" \"&แนบท้ายรายงาน!E72)","v":""},null,null,null,null,{"$f":"IF(B75=\"\",\"\",$G$9)","v":""},{"$f":"IF(B75=\"\",\"\",แนบท้ายรายงาน!I72)","v":""},null,"",null,{"$f":"IF(แนบท้ายรายงาน!J72=\"\",\"\",\"เลือกก่อนปริ้น\")","v":""}]
[null,{"$f":"IF(แนบท้ายรายงาน!B73=\"\",\"\",แนบท้ายรายงาน!B73&\".\"&\" \"&แนบท้ายรายงาน!C73&\" จำนวน \"&แนบท้ายรายงาน!D73&\" \"&แนบท้ายรายงาน!E73)","v":""},null,null,null,null,"",{"$f":"IF(B76=\"\",\"\",แนบท้ายรายงาน!I73)","v":""},null,"",null,{"$f":"IF(แนบท้ายรายงาน!J73=\"\",\"\",\"เลือกก่อนปริ้น\")","v":""}]
[null,{"$f":"IF(แนบท้ายรายงาน!B74=\"\",\"\",แนบท้ายรายงาน!B74&\".\"&\" \"&แนบท้ายรายงาน!C74&\" จำนวน \"&แนบท้ายรายงาน!D74&\" \"&แนบท้ายรายงาน!E74)","v":""},null,null,null,null,"",{"$f":"IF(B77=\"\",\"\",แนบท้ายรายงาน!I74)","v":""},null,"",null,{"$f":"IF(แนบท้ายรายงาน!J74=\"\",\"\",\"เลือกก่อนปริ้น\")","v":""}]
[null,{"$f":"IF(แนบท้ายรายงาน!B75=\"\",\"\",แนบท้ายรายงาน!B75&\".\"&\" \"&แนบท้ายรายงาน!C75&\" จำนวน \"&แนบท้ายรายงาน!D75&\" \"&แนบท้ายรายงาน!E75)","v":""},null,null,null,null,"",{"$f":"IF(B78=\"\",\"\",แนบท้ายรายงาน!I75)","v":""},null,"",null,{"$f":"IF(แนบท้ายรายงาน!J75=\"\",\"\",\"เลือกก่อนปริ้น\")","v":""}]
[null,{"$f":"IF(แนบท้ายรายงาน!B76=\"\",\"\",แนบท้ายรายงาน!B76&\".\"&\" \"&แนบท้ายรายงาน!C76&\" จำนวน \"&แนบท้ายรายงาน!D76&\" \"&แนบท้ายรายงาน!E76)","v":""},null,null,null,null,"",{"$f":"IF(B79=\"\",\"\",แนบท้ายรายงาน!I76)","v":""},null,"",null,{"$f":"IF(แนบท้ายรายงาน!J76=\"\",\"\",\"เลือกก่อนปริ้น\")","v":""}]
[null,{"$f":"IF(แนบท้ายรายงาน!B77=\"\",\"\",แนบท้ายรายงาน!B77&\".\"&\" \"&แนบท้ายรายงาน!C77&\" จำนวน \"&แนบท้ายรายงาน!D77&\" \"&แนบท้ายรายงาน!E77)","v":""},null,null,null,null,"",{"$f":"IF(B80=\"\",\"\",แนบท้ายรายงาน!I77)","v":""},null,"",null,{"$f":"IF(แนบท้ายรายงาน!J77=\"\",\"\",\"เลือกก่อนปริ้น\")","v":""}]
[null,{"$f":"IF(แนบท้ายรายงาน!B78=\"\",\"\",แนบท้ายรายงาน!B78&\".\"&\" \"&แนบท้ายรายงาน!C78&\" จำนวน \"&แนบท้ายรายงาน!D78&\" \"&แนบท้ายรายงาน!E78)","v":""},null,null,null,null,"",{"$f":"IF(B81=\"\",\"\",แนบท้ายรายงาน!I78)","v":""},null,"",null,{"$f":"IF(แนบท้ายรายงาน!J78=\"\",\"\",\"เลือกก่อนปริ้น\")","v":""}]
[null,{"$f":"IF(แนบท้ายรายงาน!B79=\"\",\"\",แนบท้ายรายงาน!B79&\".\"&\" \"&แนบท้ายรายงาน!C79&\" จำนวน \"&แนบท้ายรายงาน!D79&\" \"&แนบท้ายรายงาน!E79)","v":""},null,null,null,null,"",{"$f":"IF(B82=\"\",\"\",แนบท้ายรายงาน!I79)","v":""},null,"",null,{"$f":"IF(แนบท้ายรายงาน!J79=\"\",\"\",\"เลือกก่อนปริ้น\")","v":""}]
[null,"รวม",null,null,null,null,null,{"$f":"SUM(H9:I82)","v":6390},null,{"$f":"SUM(J9:K82)","v":6390},null,"เลือกก่อนปริ้น"]
[null,null,"เกณฑ์การพิจารณาผลการยื่นข้อเสนอครั้งนี้ จะพิจารณาตัดสินโดยใช้หลักเกณฑ์ราคา",null,null,null,null,null,null,null,null,"เลือกก่อนปริ้น"]
[null,null,{"$f":"DATABASE!C15","v":"โรงพยาบาลส่งเสริมสุขภาพตำบลบ้านกระเบื้องน้อย"},null,null,null,null,null,null,null,null,"เลือกก่อนปริ้น"]
[null,"ราคาดังกล่าว",null,null,null,null,null,null,null,null,null,"เลือกก่อนปริ้น"]
[null,null,"จึงเรียนมาเพื่อโปรดพิจารณา หากเห็นชอบขอได้โปรดอนุมัติให้สั่งซื้อจากผู้เสนอราคาดังกล่าว",null,null,null,null,null,null,null,null,"เลือกก่อนปริ้น"]
[null,null,null,null,null,null,"ลงชื่อ.............................................................",null,null,null,null,"เลือกก่อนปริ้น"]
[null,null,null,null,null,null,{"$f":"DATABASE!C11","v":"นางวรรณเพ็ญ  วศินไพบูลย์วงศ์"},null,null,null,null,"เลือกก่อนปริ้น"]
[null,null,null,null,null,null,{"$f":"DATABASE!D11","v":"เจ้าพนักงานสาธารณสุข"},null,null,null,null,"เลือกก่อนปริ้น"]
[null,null,null,null,null,"เจ้าหน้าที่",null,null,null,null,null,"เลือกก่อนปริ้น"]
[null,"เรียน","ผู้ว่าราชการจังหวัดบุรีรัมย์",null,null,null,null,"o","ทราบ/อนุมัติ",null,null,"เลือกก่อนปริ้น"]
[null,null," - เพื่อโปรดทราบ/พิจารณาอนุมัติ",null,null,null,null,"o","ไม่อนุมัติ เนื่องจาก......................",null,null,"เลือกก่อนปริ้น"]
[null,null,null,null,null,null,null,null,null,null,null,"เลือกก่อนปริ้น"]
[null,null,{"$f":"DATABASE!C7","v":"นางจุรีพร  บัวลอย"},null,null,null,null,null,null,null,null,"เลือกก่อนปริ้น"]
[null,null,{"$f":"DATABASE!D7","v":"นักวิชาการสาธารณสุข ชำนาญการ"},null,null,null,{"$f":"DATABASE!C6","v":"นายประหยัด  นงประโคน"},null,null,null,null,"เลือกก่อนปริ้น"]
[null,null,null,null,null,null,{"$f":"DATABASE!D6","v":"สาธารณสุขอำเภอหนองหงส์"},null,null,null,null,"เลือกก่อนปริ้น"]
[null,null,null,null,null,null,{"$f":"รายงานจัดซื้อ!J35","v":"ปฏิบัติราชการแทนผู้ว่าราชการจังหวัดบุรีรัมย์"},null,null,null,null,"เลือกก่อนปริ้น"]

{"sheet":"คำสั่ง","index":8,"n_rows":26,"n_cols":11,"rows_kept":26,"cut":false,"hidden":false,"merged":[[6,1,6,9],[5,1,5,9],[4,1,4,9],[24,4,24,8],[25,3,25,9],[22,5,22,7],[23,5,23,7],[18,4,18,6],[8,1,8,9]]}
[]
[]
[]
[]
[null,"คำสั่งจังหวัดบุรีรัมย์",null,null,null,null,null,null,null,null,"พิมพ์กรณีเกิน 5,000 บาท"]
[null,{"$f":"DATABASE!C9","v":"ที่ ................................../2561"}]
[null,{"$f":"เห็นชอบ!C5","v":"ซื้อวัสดุคอมพิวเตอร์ (RAM)"}]
[null,null,{"$f":"เห็นชอบ!C5","v":"ซื้อวัสดุคอมพิวเตอร์ (RAM)"}]
[null,{"$f":"รายงานจัดซื้อ!B26& \"โดยวิธีเฉพาะเจาะจง และเพื่อเป็นไปตามระเบียบกระทรวงการคลังว่าด้วยการจัดซื้อ จัดจ้าง และการบริหารพัสดุภาครัฐ พ.ศ. 2560 จึงขอแต่งตั้งรายชื่อต่อไปนี้เป็น ผู้ตรวจรับพัสดุ สำหรับการ\"&เห็นชอบ!C5&\" โดยวิธีเฉพาะเจาะจง รายนามดังนี้\"","v":"จาก หจก. ธงชัย โอเอ เซลส์แอนเซอร์วิส ที่อยู่ 68/4-5, 70 ถ.ธานี ต.ในเมือง อ.เมือง จ.บุรีรัมย์ เป็นจำนวนเงินทั้งสิ้น 6390 บาทโดยวิธีเฉพาะเจาะจง และเพื่อเป็นไปตามระเบียบกระทรวงการคลังว่าด้วยการจัดซื้อ จัดจ้าง และการบริหารพัสดุภาครัฐ พ.ศ. 2560 จึงขอแต่งตั้งรายชื่อต่อไปนี้เป็น ผู้ตรวจรับพัสดุ สำหรับการซื้อวัสดุคอมพิวเตอร์ (RAM) โดยวิธีเฉพาะเจาะจง รายนามดังนี้"}]
[null,null,"คณะกรรมการตรวจรับพัสดุ"]
[null,null,1,{"$f":"DATABASE!C16","v":"นางสุรินทร์  สีระสูงเนิน"},null,null,null,"เป็นประธานกรรมการฯ"]
[null,null,null,{"$f":"DATABASE!D16","v":"พยาบาลวิชาชีพ ชำนาญการ"}]
[null,null,2,{"$f":"DATABASE!C17","v":0},null,null,null,"เป็นกรรมการ"]
[null,null,null,{"$f":"DATABASE!D17","v":0}]
[null,null,3,{"$f":"DATABASE!C18","v":0},null,null,null,"เป็นกรรมการ"]
[null,null,null,{"$f":"DATABASE!D18","v":0}]
[null,null,"อำนาจและหน้าที่"]
[null,null,"ทำการตรวจรับพัสดุให้เป็นไปตามเงื่อนไขของสัญาหรือข้อตกลงนั้น"]
[null,null,null,"สั่ง  ณ วันที่",{"$f":"DATABASE!D9","v":"วันที่..................................................."}]
[]
[]
[]
[null,null,null,null,null,{"$f":"DATABASE!C6","v":"นายประหยัด  นงประโคน"}]
[null,null,null,null,null,{"$f":"DATABASE!D6","v":"สาธารณสุขอำเภอหนองหงส์"}]
[null,null,null,null,"ปฏิบัติราชการแทนผู้ว่าราชการจังหวัดบุรีรัมย์ตาม"]
[null,null,null,{"$f":"DATABASE!C10","v":"คำสั่งจังหวัดบุรีรัมย์ ที่ 27631/2559 ลงวันที่ 24 สิงหาคม 2560"}]

{"sheet":"ประกาศ","index":9,"n_rows":91,"n_cols":12,"rows_kept":91,"cut":false,"hidden":false,"merged":[[89,4,89,8],[90,3,90,9],[85,4,85,5],[4,1,4,9],[5,1,5,9],[87,5,87,7],[88,5,88,7]]}
[]
[]
[]
[]
[null,"ประกาศจังหวัดบุรีรัมย์",null,null,null,null,null,null,null,null,"พิมพ์กรณีเกิน 5,000 บาท"]
[null,{"$f":"เห็นชอบ!C5","v":"ซื้อวัสดุคอมพิวเตอร์ (RAM)"}]
[null,null,{"$f":"DATABASE!C15","v":"โรงพยาบาลส่งเสริมสุขภาพตำบลบ้านกระเบื้องน้อย"}]
[null,{"$f":"เห็นชอบ!C5","v":"ซื้อวัสดุคอมพิวเตอร์ (RAM)"},null,null,null,null,null,null,null,null,null,"<< เลือกตัวกรองก่อนปริ้นทุกครั้ง"]
[null,null,{"$f":"IF(ใบเสนอราคา!B12=\"\",\"\",ใบเสนอราคา!B12&\".\"&\" \"&ใบเสนอราคา!C12&\" \"&\" จำนวน\"&\" \"&ใบเสนอราคา!D12&\" \"&ใบเสนอราคา!E12&\"ๆ \"&ใบเสนอราคา!F12&\" บาท\")","v":"1. DDR 4 PC 4GB/2400 Kindmax  จำนวน 3 ตัวๆ 2130 บาท"},null,null,null,null,null,null,null,{"$f":"IF(แนบท้ายรายงาน!J6=\"\",\"\",\"เลือกเพื่อปริ้น\")","v":"เลือกเพื่อปริ้น"}]
[null,null,{"$f":"IF(ใบเสนอราคา!B13=\"\",\"\",ใบเสนอราคา!B13&\".\"&\" \"&ใบเสนอราคา!C13&\" \"&\" จำนวน\"&\" \"&ใบเสนอราคา!D13&\" \"&ใบเสนอราคา!E13&\"ๆ \"&ใบเสนอราคา!F13&\" บาท\")","v":""},null,null,null,null,null,null,null,{"$f":"IF(C10=\"\",\"\",\"เลือกเพื่อปริ้น\")","v":""}]
[null,null,{"$f":"IF(ใบเสนอราคา!B14=\"\",\"\",ใบเสนอราคา!B14&\".\"&\" \"&ใบเสนอราคา!C14&\" \"&\" จำนวน\"&\" \"&ใบเสนอราคา!D14&\" \"&ใบเสนอราคา!E14&\"ๆ \"&ใบเสนอราคา!F14&\" บาท\")","v":""},null,null,null,null,null,null,null,""]
[null,null,{"$f":"IF(ใบเสนอราคา!B15=\"\",\"\",ใบเสนอราคา!B15&\".\"&\" \"&ใบเสนอราคา!C15&\" \"&\" จำนวน\"&\" \"&ใบเสนอราคา!D15&\" \"&ใบเสนอราคา!E15&\"ๆ \"&ใบเสนอราคา!F15&\" บาท\")","v":""},null,null,null,null,null,null,null,""]
[null,null,{"$f":"IF(ใบเสนอราคา!B16=\"\",\"\",ใบเสนอราคา!B16&\".\"&\" \"&ใบเสนอราคา!C16&\" \"&\" จำนวน\"&\" \"&ใบเสนอราคา!D16&\" \"&ใบเสนอราคา!E16&\"ๆ \"&ใบเสนอราคา!F16&\" บาท\")","v":""},null,null,null,null,null,null,null,""]
[null,null,{"$f":"IF(ใบเสนอราคา!B17=\"\",\"\",ใบเสนอราคา!B17&\".\"&\" \"&ใบเสนอราคา!C17&\" \"&\" จำนวน\"&\" \"&ใบเสนอราคา!D17&\" \"&ใบเสนอราคา!E17&\"ๆ \"&ใบเสนอราคา!F17&\" บาท\")","v":""},null,null,null,null,null,null,null,""]
[null,null,{"$f":"IF(ใบเสนอราคา!B18=\"\",\"\",ใบเสนอราคา!B18&\".\"&\" \"&ใบเสนอราคา!C18&\" \"&\" จำนวน\"&\" \"&ใบเสนอราคา!D18&\" \"&ใบเสนอราคา!E18&\"ๆ \"&ใบเสนอราคา!F18&\" บาท\")","v":""},null,null,null,null,null,null,null,""]
[null,null,{"$f":"IF(ใบเสนอราคา!B19=\"\",\"\",ใบเสนอราคา!B19&\".\"&\" \"&ใบเสนอราคา!C19&\" \"&\" จำนวน\"&\" \"&ใบเสนอราคา!D19&\" \"&ใบเสนอราคา!E19&\"ๆ \"&ใบเสนอราคา!F19&\" บาท\")","v":""},null,null,null,null,null,null,null,""]
[null,null,{"$f":"IF(ใบเสนอราคา!B20=\"\",\"\",ใบเสนอราคา!B20&\".\"&\" \"&ใบเสนอราคา!C20&\" \"&\" จำนวน\"&\" \"&ใบเสนอราคา!D20&\" \"&ใบเสนอราคา!E20&\"ๆ \"&ใบเสนอราคา!F20&\" บาท\")","v":""},null,null,null,null,null,null,null,""]
[null,null,{"$f":"IF(ใบเสนอราคา!B21=\"\",\"\",ใบเสนอราคา!B21&\".\"&\" \"&ใบเสนอราคา!C21&\" \"&\" จำนวน\"&\" \"&ใบเสนอราคา!D21&\" \"&ใบเสนอราคา!E21&\"ๆ \"&ใบเสนอราคา!F21&\" บาท\")","v":""},null,null,null,null,null,null,null,""]
[null,null,{"$f":"IF(ใบเสนอราคา!B22=\"\",\"\",ใบเสนอราคา!B22&\".\"&\" \"&ใบเสนอราคา!C22&\" \"&\" จำนวน\"&\" \"&ใบเสนอราคา!D22&\" \"&ใบเสนอราคา!E22&\"ๆ \"&ใบเสนอราคา!F22&\" บาท\")","v":""},null,null,null,null,null,null,null,""]
[null,null,{"$f":"IF(ใบเสนอราคา!B23=\"\",\"\",ใบเสนอราคา!B23&\".\"&\" \"&ใบเสนอราคา!C23&\" \"&\" จำนวน\"&\" \"&ใบเสนอราคา!D23&\" \"&ใบเสนอราคา!E23&\"ๆ \"&ใบเสนอราคา!F23&\" บาท\")","v":""},null,null,null,null,null,null,null,""]
[null,null,{"$f":"IF(ใบเสนอราคา!B24=\"\",\"\",ใบเสนอราคา!B24&\".\"&\" \"&ใบเสนอราคา!C24&\" \"&\" จำนวน\"&\" \"&ใบเสนอราคา!D24&\" \"&ใบเสนอราคา!E24&\"ๆ \"&ใบเสนอราคา!F24&\" บาท\")","v":""},null,null,null,null,null,null,null,""]
[null,null,{"$f":"IF(ใบเสนอราคา!B25=\"\",\"\",ใบเสนอราคา!B25&\".\"&\" \"&ใบเสนอราคา!C25&\" \"&\" จำนวน\"&\" \"&ใบเสนอราคา!D25&\" \"&ใบเสนอราคา!E25&\"ๆ \"&ใบเสนอราคา!F25&\" บาท\")","v":""},null,null,null,null,null,null,null,""]
[null,null,{"$f":"IF(ใบเสนอราคา!B26=\"\",\"\",ใบเสนอราคา!B26&\".\"&\" \"&ใบเสนอราคา!C26&\" \"&\" จำนวน\"&\" \"&ใบเสนอราคา!D26&\" \"&ใบเสนอราคา!E26&\"ๆ \"&ใบเสนอราคา!F26&\" บาท\")","v":""},null,null,null,null,null,null,null,""]
[null,null,{"$f":"IF(ใบเสนอราคา!B27=\"\",\"\",ใบเสนอราคา!B27&\".\"&\" \"&ใบเสนอราคา!C27&\" \"&\" จำนวน\"&\" \"&ใบเสนอราคา!D27&\" \"&ใบเสนอราคา!E27&\"ๆ \"&ใบเสนอราคา!F27&\" บาท\")","v":""},null,null,null,null,null,null,null,""]
[null,null,{"$f":"IF(ใบเสนอราคา!B28=\"\",\"\",ใบเสนอราคา!B28&\".\"&\" \"&ใบเสนอราคา!C28&\" \"&\" จำนวน\"&\" \"&ใบเสนอราคา!D28&\" \"&ใบเสนอราคา!E28&\"ๆ \"&ใบเสนอราคา!F28&\" บาท\")","v":""},null,null,null,null,null,null,null,""]
[null,null,{"$f":"IF(ใบเสนอราคา!B29=\"\",\"\",ใบเสนอราคา!B29&\".\"&\" \"&ใบเสนอราคา!C29&\" \"&\" จำนวน\"&\" \"&ใบเสนอราคา!D29&\" \"&ใบเสนอราคา!E29&\"ๆ \"&ใบเสนอราคา!F29&\" บาท\")","v":""},null,null,null,null,null,null,null,""]
[null,null,{"$f":"IF(ใบเสนอราคา!B30=\"\",\"\",ใบเสนอราคา!B30&\".\"&\" \"&ใบเสนอราคา!C30&\" \"&\" จำนวน\"&\" \"&ใบเสนอราคา!D30&\" \"&ใบเสนอราคา!E30&\"ๆ \"&ใบเสนอราคา!F30&\" บาท\")","v":""},null,null,null,null,null,null,null,""]
[null,null,{"$f":"IF(ใบเสนอราคา!B31=\"\",\"\",ใบเสนอราคา!B31&\".\"&\" \"&ใบเสนอราคา!C31&\" \"&\" จำนวน\"&\" \"&ใบเสนอราคา!D31&\" \"&ใบเสนอราคา!E31&\"ๆ \"&ใบเสนอราคา!F31&\" บาท\")","v":""},null,null,null,null,null,null,null,""]
[null,null,{"$f":"IF(ใบเสนอราคา!B32=\"\",\"\",ใบเสนอราคา!B32&\".\"&\" \"&ใบเสนอราคา!C32&\" \"&\" จำนวน\"&\" \"&ใบเสนอราคา!D32&\" \"&ใบเสนอราคา!E32&\"ๆ \"&ใบเสนอราคา!F32&\" บาท\")","v":""},null,null,null,null,null,null,null,""]
[null,null,{"$f":"IF(ใบเสนอราคา!B33=\"\",\"\",ใบเสนอราคา!B33&\".\"&\" \"&ใบเสนอราคา!C33&\" \"&\" จำนวน\"&\" \"&ใบเสนอราคา!D33&\" \"&ใบเสนอราคา!E33&\"ๆ \"&ใบเสนอราคา!F33&\" บาท\")","v":""},null,null,null,null,null,null,null,""]
[null,null,{"$f":"IF(ใบเสนอราคา!B34=\"\",\"\",ใบเสนอราคา!B34&\".\"&\" \"&ใบเสนอราคา!C34&\" \"&\" จำนวน\"&\" \"&ใบเสนอราคา!D34&\" \"&ใบเสนอราคา!E34&\"ๆ \"&ใบเสนอราคา!F34&\" บาท\")","v":""},null,null,null,null,null,null,null,""]
[null,null,{"$f":"IF(ใบเสนอราคา!B35=\"\",\"\",ใบเสนอราคา!B35&\".\"&\" \"&ใบเสนอราคา!C35&\" \"&\" จำนวน\"&\" \"&ใบเสนอราคา!D35&\" \"&ใบเสนอราคา!E35&\"ๆ \"&ใบเสนอราคา!F35&\" บาท\")","v":""},null,null,null,null,null,null,null,""]
[null,null,{"$f":"IF(ใบเสนอราคา!B36=\"\",\"\",ใบเสนอราคา!B36&\".\"&\" \"&ใบเสนอราคา!C36&\" \"&\" จำนวน\"&\" \"&ใบเสนอราคา!D36&\" \"&ใบเสนอราคา!E36&\"ๆ \"&ใบเสนอราคา!F36&\" บาท\")","v":""},null,null,null,null,null,null,null,""]
[null,null,{"$f":"IF(ใบเสนอราคา!B37=\"\",\"\",ใบเสนอราคา!B37&\".\"&\" \"&ใบเสนอราคา!C37&\" \"&\" จำนวน\"&\" \"&ใบเสนอราคา!D37&\" \"&ใบเสนอราคา!E37&\"ๆ \"&ใบเสนอราคา!F37&\" บาท\")","v":""},null,null,null,null,null,null,null,""]
[null,null,{"$f":"IF(ใบเสนอราคา!B38=\"\",\"\",ใบเสนอราคา!B38&\".\"&\" \"&ใบเสนอราคา!C38&\" \"&\" จำนวน\"&\" \"&ใบเสนอราคา!D38&\" \"&ใบเสนอราคา!E38&\"ๆ \"&ใบเสนอราคา!F38&\" บาท\")","v":""},null,null,null,null,null,null,null,""]
[null,null,{"$f":"IF(ใบเสนอราคา!B39=\"\",\"\",ใบเสนอราคา!B39&\".\"&\" \"&ใบเสนอราคา!C39&\" \"&\" จำนวน\"&\" \"&ใบเสนอราคา!D39&\" \"&ใบเสนอราคา!E39&\"ๆ \"&ใบเสนอราคา!F39&\" บาท\")","v":""},null,null,null,null,null,null,null,""]
[null,null,{"$f":"IF(ใบเสนอราคา!B40=\"\",\"\",ใบเสนอราคา!B40&\".\"&\" \"&ใบเสนอราคา!C40&\" \"&\" จำนวน\"&\" \"&ใบเสนอราคา!D40&\" \"&ใบเสนอราคา!E40&\"ๆ \"&ใบเสนอราคา!F40&\" บาท\")","v":""},null,null,null,null,null,null,null,""]
[null,null,{"$f":"IF(ใบเสนอราคา!B41=\"\",\"\",ใบเสนอราคา!B41&\".\"&\" \"&ใบเสนอราคา!C41&\" \"&\" จำนวน\"&\" \"&ใบเสนอราคา!D41&\" \"&ใบเสนอราคา!E41&\"ๆ \"&ใบเสนอราคา!F41&\" บาท\")","v":""},null,null,null,null,null,null,null,""]
[null,null,{"$f":"IF(ใบเสนอราคา!B42=\"\",\"\",ใบเสนอราคา!B42&\".\"&\" \"&ใบเสนอราคา!C42&\" \"&\" จำนวน\"&\" \"&ใบเสนอราคา!D42&\" \"&ใบเสนอราคา!E42&\"ๆ \"&ใบเสนอราคา!F42&\" บาท\")","v":""},null,null,null,null,null,null,null,""]
[null,null,{"$f":"IF(ใบเสนอราคา!B43=\"\",\"\",ใบเสนอราคา!B43&\".\"&\" \"&ใบเสนอราคา!C43&\" \"&\" จำนวน\"&\" \"&ใบเสนอราคา!D43&\" \"&ใบเสนอราคา!E43&\"ๆ \"&ใบเสนอราคา!F43&\" บาท\")","v":""},null,null,null,null,null,null,null,""]
[null,null,{"$f":"IF(ใบเสนอราคา!B44=\"\",\"\",ใบเสนอราคา!B44&\".\"&\" \"&ใบเสนอราคา!C44&\" \"&\" จำนวน\"&\" \"&ใบเสนอราคา!D44&\" \"&ใบเสนอราคา!E44&\"ๆ \"&ใบเสนอราคา!F44&\" บาท\")","v":""},null,null,null,null,null,null,null,""]
[null,null,{"$f":"IF(ใบเสนอราคา!B45=\"\",\"\",ใบเสนอราคา!B45&\".\"&\" \"&ใบเสนอราคา!C45&\" \"&\" จำนวน\"&\" \"&ใบเสนอราคา!D45&\" \"&ใบเสนอราคา!E45&\"ๆ \"&ใบเสนอราคา!F45&\" บาท\")","v":""},null,null,null,null,null,null,null,""]
[null,null,{"$f":"IF(ใบเสนอราคา!B46=\"\",\"\",ใบเสนอราคา!B46&\".\"&\" \"&ใบเสนอราคา!C46&\" \"&\" จำนวน\"&\" \"&ใบเสนอราคา!D46&\" \"&ใบเสนอราคา!E46&\"ๆ \"&ใบเสนอราคา!F46&\" บาท\")","v":""},null,null,null,null,null,null,null,""]
[null,null,{"$f":"IF(ใบเสนอราคา!B47=\"\",\"\",ใบเสนอราคา!B47&\".\"&\" \"&ใบเสนอราคา!C47&\" \"&\" จำนวน\"&\" \"&ใบเสนอราคา!D47&\" \"&ใบเสนอราคา!E47&\"ๆ \"&ใบเสนอราคา!F47&\" บาท\")","v":""},null,null,null,null,null,null,null,""]
[null,null,{"$f":"IF(ใบเสนอราคา!B48=\"\",\"\",ใบเสนอราคา!B48&\".\"&\" \"&ใบเสนอราคา!C48&\" \"&\" จำนวน\"&\" \"&ใบเสนอราคา!D48&\" \"&ใบเสนอราคา!E48&\"ๆ \"&ใบเสนอราคา!F48&\" บาท\")","v":""},null,null,null,null,null,null,null,""]
[null,null,{"$f":"IF(ใบเสนอราคา!B49=\"\",\"\",ใบเสนอราคา!B49&\".\"&\" \"&ใบเสนอราคา!C49&\" \"&\" จำนวน\"&\" \"&ใบเสนอราคา!D49&\" \"&ใบเสนอราคา!E49&\"ๆ \"&ใบเสนอราคา!F49&\" บาท\")","v":""},null,null,null,null,null,null,null,""]
[null,null,{"$f":"IF(ใบเสนอราคา!B50=\"\",\"\",ใบเสนอราคา!B50&\".\"&\" \"&ใบเสนอราคา!C50&\" \"&\" จำนวน\"&\" \"&ใบเสนอราคา!D50&\" \"&ใบเสนอราคา!E50&\"ๆ \"&ใบเสนอราคา!F50&\" บาท\")","v":""},null,null,null,null,null,null,null,""]
[null,null,{"$f":"IF(ใบเสนอราคา!B51=\"\",\"\",ใบเสนอราคา!B51&\".\"&\" \"&ใบเสนอราคา!C51&\" \"&\" จำนวน\"&\" \"&ใบเสนอราคา!D51&\" \"&ใบเสนอราคา!E51&\"ๆ \"&ใบเสนอราคา!F51&\" บาท\")","v":""},null,null,null,null,null,null,null,""]
[null,null,{"$f":"IF(ใบเสนอราคา!B52=\"\",\"\",ใบเสนอราคา!B52&\".\"&\" \"&ใบเสนอราคา!C52&\" \"&\" จำนวน\"&\" \"&ใบเสนอราคา!D52&\" \"&ใบเสนอราคา!E52&\"ๆ \"&ใบเสนอราคา!F52&\" บาท\")","v":""},null,null,null,null,null,null,null,""]
[null,null,{"$f":"IF(ใบเสนอราคา!B53=\"\",\"\",ใบเสนอราคา!B53&\".\"&\" \"&ใบเสนอราคา!C53&\" \"&\" จำนวน\"&\" \"&ใบเสนอราคา!D53&\" \"&ใบเสนอราคา!E53&\"ๆ \"&ใบเสนอราคา!F53&\" บาท\")","v":""},null,null,null,null,null,null,null,""]
[null,null,{"$f":"IF(ใบเสนอราคา!B54=\"\",\"\",ใบเสนอราคา!B54&\".\"&\" \"&ใบเสนอราคา!C54&\" \"&\" จำนวน\"&\" \"&ใบเสนอราคา!D54&\" \"&ใบเสนอราคา!E54&\"ๆ \"&ใบเสนอราคา!F54&\" บาท\")","v":""},null,null,null,null,null,null,null,""]
[null,null,{"$f":"IF(ใบเสนอราคา!B55=\"\",\"\",ใบเสนอราคา!B55&\".\"&\" \"&ใบเสนอราคา!C55&\" \"&\" จำนวน\"&\" \"&ใบเสนอราคา!D55&\" \"&ใบเสนอราคา!E55&\"ๆ \"&ใบเสนอราคา!F55&\" บาท\")","v":""},null,null,null,null,null,null,null,""]
[null,null,{"$f":"IF(ใบเสนอราคา!B56=\"\",\"\",ใบเสนอราคา!B56&\".\"&\" \"&ใบเสนอราคา!C56&\" \"&\" จำนวน\"&\" \"&ใบเสนอราคา!D56&\" \"&ใบเสนอราคา!E56&\"ๆ \"&ใบเสนอราคา!F56&\" บาท\")","v":""},null,null,null,null,null,null,null,""]
[null,null,{"$f":"IF(ใบเสนอราคา!B57=\"\",\"\",ใบเสนอราคา!B57&\".\"&\" \"&ใบเสนอราคา!C57&\" \"&\" จำนวน\"&\" \"&ใบเสนอราคา!D57&\" \"&ใบเสนอราคา!E57&\"ๆ \"&ใบเสนอราคา!F57&\" บาท\")","v":""},null,null,null,null,null,null,null,""]
[null,null,{"$f":"IF(ใบเสนอราคา!B58=\"\",\"\",ใบเสนอราคา!B58&\".\"&\" \"&ใบเสนอราคา!C58&\" \"&\" จำนวน\"&\" \"&ใบเสนอราคา!D58&\" \"&ใบเสนอราคา!E58&\"ๆ \"&ใบเสนอราคา!F58&\" บาท\")","v":""},null,null,null,null,null,null,null,""]
[null,null,{"$f":"IF(ใบเสนอราคา!B59=\"\",\"\",ใบเสนอราคา!B59&\".\"&\" \"&ใบเสนอราคา!C59&\" \"&\" จำนวน\"&\" \"&ใบเสนอราคา!D59&\" \"&ใบเสนอราคา!E59&\"ๆ \"&ใบเสนอราคา!F59&\" บาท\")","v":""},null,null,null,null,null,null,null,""]
[null,null,{"$f":"IF(ใบเสนอราคา!B60=\"\",\"\",ใบเสนอราคา!B60&\".\"&\" \"&ใบเสนอราคา!C60&\" \"&\" จำนวน\"&\" \"&ใบเสนอราคา!D60&\" \"&ใบเสนอราคา!E60&\"ๆ \"&ใบเสนอราคา!F60&\" บาท\")","v":""},null,null,null,null,null,null,null,""]
[null,null,{"$f":"IF(ใบเสนอราคา!B61=\"\",\"\",ใบเสนอราคา!B61&\".\"&\" \"&ใบเสนอราคา!C61&\" \"&\" จำนวน\"&\" \"&ใบเสนอราคา!D61&\" \"&ใบเสนอราคา!E61&\"ๆ \"&ใบเสนอราคา!F61&\" บาท\")","v":""},null,null,null,null,null,null,null,""]
[null,null,{"$f":"IF(ใบเสนอราคา!B62=\"\",\"\",ใบเสนอราคา!B62&\".\"&\" \"&ใบเสนอราคา!C62&\" \"&\" จำนวน\"&\" \"&ใบเสนอราคา!D62&\" \"&ใบเสนอราคา!E62&\"ๆ \"&ใบเสนอราคา!F62&\" บาท\")","v":""},null,null,null,null,null,null,null,""]
[null,null,{"$f":"IF(ใบเสนอราคา!B63=\"\",\"\",ใบเสนอราคา!B63&\".\"&\" \"&ใบเสนอราคา!C63&\" \"&\" จำนวน\"&\" \"&ใบเสนอราคา!D63&\" \"&ใบเสนอราคา!E63&\"ๆ \"&ใบเสนอราคา!F63&\" บาท\")","v":""},null,null,null,null,null,null,null,""]
[null,null,{"$f":"IF(ใบเสนอราคา!B64=\"\",\"\",ใบเสนอราคา!B64&\".\"&\" \"&ใบเสนอราคา!C64&\" \"&\" จำนวน\"&\" \"&ใบเสนอราคา!D64&\" \"&ใบเสนอราคา!E64&\"ๆ \"&ใบเสนอราคา!F64&\" บาท\")","v":""},null,null,null,null,null,null,null,""]
[null,null,{"$f":"IF(ใบเสนอราคา!B65=\"\",\"\",ใบเสนอราคา!B65&\".\"&\" \"&ใบเสนอราคา!C65&\" \"&\" จำนวน\"&\" \"&ใบเสนอราคา!D65&\" \"&ใบเสนอราคา!E65&\"ๆ \"&ใบเสนอราคา!F65&\" บาท\")","v":""},null,null,null,null,null,null,null,""]
[null,null,{"$f":"IF(ใบเสนอราคา!B66=\"\",\"\",ใบเสนอราคา!B66&\".\"&\" \"&ใบเสนอราคา!C66&\" \"&\" จำนวน\"&\" \"&ใบเสนอราคา!D66&\" \"&ใบเสนอราคา!E66&\"ๆ \"&ใบเสนอราคา!F66&\" บาท\")","v":""},null,null,null,null,null,null,null,""]
[null,null,{"$f":"IF(ใบเสนอราคา!B67=\"\",\"\",ใบเสนอราคา!B67&\".\"&\" \"&ใบเสนอราคา!C67&\" \"&\" จำนวน\"&\" \"&ใบเสนอราคา!D67&\" \"&ใบเสนอราคา!E67&\"ๆ \"&ใบเสนอราคา!F67&\" บาท\")","v":""},null,null,null,null,null,null,null,""]
[null,null,{"$f":"IF(ใบเสนอราคา!B68=\"\",\"\",ใบเสนอราคา!B68&\".\"&\" \"&ใบเสนอราคา!C68&\" \"&\" จำนวน\"&\" \"&ใบเสนอราคา!D68&\" \"&ใบเสนอราคา!E68&\"ๆ \"&ใบเสนอราคา!F68&\" บาท\")","v":""},null,null,null,null,null,null,null,""]
[null,null,{"$f":"IF(ใบเสนอราคา!B69=\"\",\"\",ใบเสนอราคา!B69&\".\"&\" \"&ใบเสนอราคา!C69&\" \"&\" จำนวน\"&\" \"&ใบเสนอราคา!D69&\" \"&ใบเสนอราคา!E69&\"ๆ \"&ใบเสนอราคา!F69&\" บาท\")","v":""},null,null,null,null,null,null,null,""]
[null,null,{"$f":"IF(ใบเสนอราคา!B70=\"\",\"\",ใบเสนอราคา!B70&\".\"&\" \"&ใบเสนอราคา!C70&\" \"&\" จำนวน\"&\" \"&ใบเสนอราคา!D70&\" \"&ใบเสนอราคา!E70&\"ๆ \"&ใบเสนอราคา!F70&\" บาท\")","v":""},null,null,null,null,null,null,null,""]
[null,null,{"$f":"IF(ใบเสนอราคา!B71=\"\",\"\",ใบเสนอราคา!B71&\".\"&\" \"&ใบเสนอราคา!C71&\" \"&\" จำนวน\"&\" \"&ใบเสนอราคา!D71&\" \"&ใบเสนอราคา!E71&\"ๆ \"&ใบเสนอราคา!F71&\" บาท\")","v":""},null,null,null,null,null,null,null,""]
[null,null,{"$f":"IF(ใบเสนอราคา!B72=\"\",\"\",ใบเสนอราคา!B72&\".\"&\" \"&ใบเสนอราคา!C72&\" \"&\" จำนวน\"&\" \"&ใบเสนอราคา!D72&\" \"&ใบเสนอราคา!E72&\"ๆ \"&ใบเสนอราคา!F72&\" บาท\")","v":""},null,null,null,null,null,null,null,""]
[null,null,{"$f":"IF(ใบเสนอราคา!B73=\"\",\"\",ใบเสนอราคา!B73&\".\"&\" \"&ใบเสนอราคา!C73&\" \"&\" จำนวน\"&\" \"&ใบเสนอราคา!D73&\" \"&ใบเสนอราคา!E73&\"ๆ \"&ใบเสนอราคา!F73&\" บาท\")","v":""},null,null,null,null,null,null,null,""]
[null,null,{"$f":"IF(ใบเสนอราคา!B74=\"\",\"\",ใบเสนอราคา!B74&\".\"&\" \"&ใบเสนอราคา!C74&\" \"&\" จำนวน\"&\" \"&ใบเสนอราคา!D74&\" \"&ใบเสนอราคา!E74&\"ๆ \"&ใบเสนอราคา!F74&\" บาท\")","v":""},null,null,null,null,null,null,null,""]
[null,null,{"$f":"IF(ใบเสนอราคา!B75=\"\",\"\",ใบเสนอราคา!B75&\".\"&\" \"&ใบเสนอราคา!C75&\" \"&\" จำนวน\"&\" \"&ใบเสนอราคา!D75&\" \"&ใบเสนอราคา!E75&\"ๆ \"&ใบเสนอราคา!F75&\" บาท\")","v":""},null,null,null,null,null,null,null,""]
[null,null,{"$f":"IF(ใบเสนอราคา!B76=\"\",\"\",ใบเสนอราคา!B76&\".\"&\" \"&ใบเสนอราคา!C76&\" \"&\" จำนวน\"&\" \"&ใบเสนอราคา!D76&\" \"&ใบเสนอราคา!E76&\"ๆ \"&ใบเสนอราคา!F76&\" บาท\")","v":""},null,null,null,null,null,null,null,""]
[null,null,{"$f":"IF(ใบเสนอราคา!B77=\"\",\"\",ใบเสนอราคา!B77&\".\"&\" \"&ใบเสนอราคา!C77&\" \"&\" จำนวน\"&\" \"&ใบเสนอราคา!D77&\" \"&ใบเสนอราคา!E77&\"ๆ \"&ใบเสนอราคา!F77&\" บาท\")","v":""},null,null,null,null,null,null,null,{"$f":"IF(C74=\"\",\"\",\"เลือกเพื่อปริ้น\")","v":""}]
[null,null,{"$f":"IF(ใบเสนอราคา!B78=\"\",\"\",ใบเสนอราคา!B78&\".\"&\" \"&ใบเสนอราคา!C78&\" \"&\" จำนวน\"&\" \"&ใบเสนอราคา!D78&\" \"&ใบเสนอราคา!E78&\"ๆ \"&ใบเสนอราคา!F78&\" บาท\")","v":""},null,null,null,null,null,null,null,""]
[null,null,{"$f":"IF(ใบเสนอราคา!B79=\"\",\"\",ใบเสนอราคา!B79&\".\"&\" \"&ใบเสนอราคา!C79&\" \"&\" จำนวน\"&\" \"&ใบเสนอราคา!D79&\" \"&ใบเสนอราคา!E79&\"ๆ \"&ใบเสนอราคา!F79&\" บาท\")","v":""},null,null,null,null,null,null,null,""]
[null,null,{"$f":"IF(ใบเสนอราคา!B80=\"\",\"\",ใบเสนอราคา!B80&\".\"&\" \"&ใบเสนอราคา!C80&\" \"&\" จำนวน\"&\" \"&ใบเสนอราคา!D80&\" \"&ใบเสนอราคา!E80&\"ๆ \"&ใบเสนอราคา!F80&\" บาท\")","v":""},null,null,null,null,null,null,null,""]
[null,null,{"$f":"IF(ใบเสนอราคา!B81=\"\",\"\",ใบเสนอราคา!B81&\".\"&\" \"&ใบเสนอราคา!C81&\" \"&\" จำนวน\"&\" \"&ใบเสนอราคา!D81&\" \"&ใบเสนอราคา!E81&\"ๆ \"&ใบเสนอราคา!F81&\" บาท\")","v":""},null,null,null,null,null,null,null,""]
[null,null,{"$f":"IF(ใบเสนอราคา!B82=\"\",\"\",ใบเสนอราคา!B82&\".\"&\" \"&ใบเสนอราคา!C82&\" \"&\" จำนวน\"&\" \"&ใบเสนอราคา!D82&\" \"&ใบเสนอราคา!E82&\"ๆ \"&ใบเสนอราคา!F82&\" บาท\")","v":""},null,null,null,null,null,null,null,""]
[null,null,{"$f":"IF(ใบเสนอราคา!B83=\"\",\"\",ใบเสนอราคา!B83&\".\"&\" \"&ใบเสนอราคา!C83&\" \"&\" จำนวน\"&\" \"&ใบเสนอราคา!D83&\" \"&ใบเสนอราคา!E83&\"ๆ \"&ใบเสนอราคา!F83&\" บาท\")","v":""},null,null,null,null,null,null,null,""]
[null,null,{"$f":"IF(ใบเสนอราคา!B84=\"\",\"\",ใบเสนอราคา!B84&\".\"&\" \"&ใบเสนอราคา!C84&\" \"&\" จำนวน\"&\" \"&ใบเสนอราคา!D84&\" \"&ใบเสนอราคา!E84&\"ๆ \"&ใบเสนอราคา!F84&\" บาท\")","v":""},null,null,null,null,null,null,null,""]
[null,null,{"$f":"IF(ใบเสนอราคา!B85=\"\",\"\",ใบเสนอราคา!B85&\".\"&\" \"&ใบเสนอราคา!C85&\" \"&\" จำนวน\"&\" \"&ใบเสนอราคา!D85&\" \"&ใบเสนอราคา!E85&\"ๆ \"&ใบเสนอราคา!F85&\" บาท\")","v":""},null,null,null,null,null,null,null,""]
[null,"ผู้เสนอราคาที่ชนะการเสนอราคา ได้แก่",null,null,{"$f":"DATABASE!C19","v":"หจก. ธงชัย โอเอ เซลส์แอนเซอร์วิส"},null,null,null,null,null,"เลือกเพื่อปริ้น"]
[null,{"$f":"ใบเสนอราคา!G86","v":6390},"บาท",{"$f":"\"(\"&BAHTTEXT(B84)&\")\"","v":"(หกพันสามร้อยเก้าสิบบาทถ้วน)"},null,null,null,null,null,null,"เลือกเพื่อปริ้น"]
[null,"ค่าจดทะเบียน และค่าใช้จ่ายอื่นๆ ทั้งปวง",null,null,null,null,null,null,null,null,"เลือกเพื่อปริ้น"]
[null,null,"ประกาศ  ณ วันที่",null,"2560-12-05",null,null,null,null,null,"เลือกเพื่อปริ้น"]
[null,null,null,null,null,null,null,null,null,null,"เลือกเพื่อปริ้น"]
[null,null,null,null,null,{"$f":"DATABASE!C6","v":"นายประหยัด  นงประโคน"},null,null,null,null,"เลือกเพื่อปริ้น"]
[null,null,null,null,null,{"$f":"DATABASE!D6","v":"สาธารณสุขอำเภอหนองหงส์"},null,null,null,null,"เลือกเพื่อปริ้น"]
[null,null,null,null,"ปฏิบัติราชการแทนผู้ว่าราชการจังหวัดบุรีรัมย์ตาม",null,null,null,null,null,"เลือกเพื่อปริ้น"]
[null,null,null,{"$f":"DATABASE!C10","v":"คำสั่งจังหวัดบุรีรัมย์ ที่ 27631/2559 ลงวันที่ 24 สิงหาคม 2560"},null,null,null,null,null,null,"เลือกเพื่อปริ้น"]

{"sheet":"รายงานข้อ 16","index":10,"n_rows":36,"n_cols":11,"rows_kept":36,"cut":false,"hidden":false,"merged":[[34,1,34,6],[34,7,34,11],[35,1,35,6],[10,1,10,11],[12,1,12,11],[13,5,13,11],[24,1,24,11],[33,3,33,5],[33,7,33,11],[6,7,6,9],[0,1,0,11],[1,3,1,11],[2,2,2,3],[2,7,2,9]]}
[null,"บันทึกข้อความ"]
[null,"ส่วนราชการ",null,{"$f":"DATABASE!C4&\" \"&DATABASE!D4","v":"สำนักงานสาธารณสุขอำเภอหนองหงส์ อำเภอหนองหงส์  จังหวัดบุรีรัมย์ 31240 "}]
[null,"ที่",{"$f":"DATABASE!C3","v":"บร 1332.1/"},null,325,null,"วันที่","2562-03-21"]
[null,"เรื่อง",{"$f":"เห็นชอบ!C5","v":"ซื้อวัสดุคอมพิวเตอร์ (RAM)"}]
[null,"เรียน",{"$f":"รายงานจัดซื้อ!C5","v":"ผู้ว่าราชการจังหวัดบุรีรัมย์ (โดยสาธารณสุขอำเภอหนองหงส์ปฏิบัติราชการแทน)"}]
[null,null,null,"เรื่องเดิม"]
[null,null,null,{"$f":"\"ตามบันทึกรายงานขอซื้อ/ขอจ้าง \"&รายงานจัดซื้อ!B3&\" \"&รายงานจัดซื้อ!C3&\" \"&รายงานจัดซื้อ!E3&\" \"&\" ลงวันที่\"","v":"ตามบันทึกรายงานขอซื้อ/ขอจ้าง ที่ บร 1332.1/ 318  ลงวันที่"},null,null,null,{"$f":"รายงานจัดซื้อ!H3","v":"2562-03-15"}]
[null,{"$f":"\"ได้อนุมัติให้จัดซื้อ\"&เห็นชอบ!C5&\" \"&\" โดยวิธีเฉพาะเจาะจง กับร้าน \"&DATABASE!C19","v":"ได้อนุมัติให้จัดซื้อซื้อวัสดุคอมพิวเตอร์ (RAM)  โดยวิธีเฉพาะเจาะจง กับร้าน หจก. ธงชัย โอเอ เซลส์แอนเซอร์วิส"}]
[null,{"$f":"\"รวมเป็นเงินทั้งสิ้น \"&ใบสั่งซื้อ!G82&\" บาท \"&\"(\"&BAHTTEXT(ใบสั่งซื้อ!G82)&\") \"&\" \"&\"โดยเบิกจ่ายจากเงินบำรุง\"&DATABASE!C15","v":"รวมเป็นเงินทั้งสิ้น 6390 บาท (หกพันสามร้อยเก้าสิบบาทถ้วน)  โดยเบิกจ่ายจากเงินบำรุงโรงพยาบาลส่งเสริมสุขภาพตำบลบ้านกระเบื้องน้อย"}]
[null,null,null,"ข้อเท็จจริง"]
[null,{"$f":"\"ร้าน \"&DATABASE!C19&\" ได้ส่งมอบ\"&เห็นชอบ!C5&\" เมื่อวันที่ \"&'ใบส่งของ มอบ'!N1&\"/\"&'ใบส่งของ มอบ'!O1&\"/\"&'ใบส่งของ มอบ'!P1&\" ตามเอกสาร เลขที่..............................เล่มที่.......................................ลงวันที่...........................................................จำนวนเงิน \"&ใบสั่งซื้อ!G82&\" บาท \"&\"(\"&BAHTTEXT(ใบสั่งซื้อ!G82)&\")\"&\" และผู้ตรวจรับพัสดุ ได้ทำการตรวจรับไว้เป็นการถูกต้อง ครบถ้วน ตามเงื่อนไข ดังรายละเอียดในใบสั่งซื้อ/จ้าง เลขที่\"&ใบสั่งซื้อ!F4&\" ลงวันที่ \"&ใบสั่งซื้อ!K3&\"/\"&ใบสั่งซื้อ!L3&\"/\"&ใบสั่งซื้อ!M3&\" และผู้ตรวจรับพัสดุได้ทำการตรวจรับเรียบร้อยแล้วตามใบตรวจรับการจัดซื้อ ที่แนบมาพร้อมนี้\"","v":"ร้าน หจก. ธงชัย โอเอ เซลส์แอนเซอร์วิส ได้ส่งมอบซื้อวัสดุคอมพิวเตอร์ (RAM) เมื่อวันที่ 21/3/2562 ตามเอกสาร เลขที่..............................เล่มที่.......................................ลงวันที่...........................................................จำนวนเงิน 6390 บาท (หกพันสามร้อยเก้าสิบบาทถ้วน) และผู้ตรวจรับพัสดุ ได้ทำการตรวจรับไว้เป็นการถูกต้อง ครบถ้วน ตามเงื่อนไข ดังรายละเอียดในใบสั่งซื้อ/จ้าง เลขที่108/2562 ลงวันที่ 18/3/2562 และผู้ตรวจรับพัสดุได้ทำการตรวจรับเรียบร้อยแล้วตามใบตรวจรับการจัดซื้อ ที่แนบมาพร้อมนี้"}]
[null,null,null,"ข้อกฎหมายและข้อระเบียบ"]
[null,"                    ระเบียบกระทรวงการคลังว่าด้วยการจัดซื้อจัดจ้างและการบริหารพัสดุภาครัฐ พ.ศ. 2560 ข้อ 16 เมื่อสิ้นสุดกระบวนการจัดซื้อจัดจ้างในแต่ละโครงการ ให้หน่วยงานของรัฐจัดให้มีการบันทึกรายงานผลการพิจารณา รายละเอียดวิธีการและขั้นตอนการจัดซื้อจัดจ้างพร้อมทั้งเอกสารหลักฐานประกอบ ตามรายการดังต่อไปนี้"]
[null,null,1,"รายงานขอซื้อ/ขอจ้าง"]
[null,null,2,"ใบสั่งจ้าง "]
[null,"ลงวันที่ 5 ตุลาคม 2560 เรื่อง แนวทางการบริหารจัดการโครงการพัฒนาระบบบริการดูแลระยะยาวด้านสาธารณสุขสำหรับ"]
[null,"ผู้สูงอายุที่มีภาวะพึ่งพิง (Long Term Care) (เอกสารแนบ 4)"]
[null,null,3,"ใบตรวจรับการจัดจ้าง"]
[null,null,4,"แบบแสดงความบริสุทธิ์ใจในการจัดซื้อจัดจ้างของหน่วยงาน"]
[null,null,5,"บันทึกรายงานผลการตรวจรับพัสดุ"]
[null,null,null,"ข้อพิจารณาและข้อเสนอ "]
[null,null,null,"เพื่อให้การดำเนินการเป็นไปตามระเบียบกระทรวงการคลังว่าด้วยการจัดซื้อจัดจ้างและการบริหารพัสดุภาครัฐ พ.ศ. 2560"]
[null,null,null,2,{"$f":"[2]DATABASE!C18","v":0},null,{"$f":"[2]DATABASE!D18","v":0},null,null,null,"กรรมการ"]
[null,null,null,3,{"$f":"[2]DATABASE!C19","v":0},null,{"$f":"[2]DATABASE!D19","v":0},null,null,null,"กรรมการ"]
[null,{"$f":"\"ข้อ 16 จึงขอรายงานผลการพิจารณารายละเอียด วิธีการและขั้นตอนการจัดซื้อ\"&เห็นชอบ!C5&\" จำนวนเงิน \"&ใบสั่งซื้อ!G82&\" บาท \"&\"(\"&BAHTTEXT(ใบสั่งซื้อ!G82)&\") \"&\" \"&\"ดังรายละเอียดที่แนบมาพร้อมนี้ \"","v":"ข้อ 16 จึงขอรายงานผลการพิจารณารายละเอียด วิธีการและขั้นตอนการจัดซื้อซื้อวัสดุคอมพิวเตอร์ (RAM) จำนวนเงิน 6390 บาท (หกพันสามร้อยเก้าสิบบาทถ้วน)  ดังรายละเอียดที่แนบมาพร้อมนี้ "}]
[null,null,null,"จึงเรียนมาเพื่อโปรดพิจารณา "]
[null,null,null,null,null,"ลงชื่อ","…………..............……………………………เจ้าหน้าที่"]
[null,null,null,null,null,null,{"$f":"DATABASE!C11","v":"นางวรรณเพ็ญ  วศินไพบูลย์วงศ์"}]
[null,null,null,null,null,null,{"$f":"DATABASE!D11","v":"เจ้าพนักงานสาธารณสุข"}]
[null,"เรียน",{"$f":"C5","v":"ผู้ว่าราชการจังหวัดบุรีรัมย์ (โดยสาธารณสุขอำเภอหนองหงส์ปฏิบัติราชการแทน)"}]
[null,null,null," - การจัดจ้างครั้งนี้เป็นไปตามวิธีการและขั้นตอนตามระเบียบฯ",null,null,null,null,"o","ทราบ / ดำเนินการ"]
[null,null,null,"ข้อ 16 ทุกประการ  จึงเรียนมาเพื่อโปรดทราบ"]
[]
[null,null,null,{"$f":"DATABASE!C7","v":"นางจุรีพร  บัวลอย"},null,null,null,{"$f":"DATABASE!C6","v":"นายประหยัด  นงประโคน"}]
[null,{"$f":"DATABASE!D7","v":"นักวิชาการสาธารณสุข ชำนาญการ"},null,null,null,null,null,{"$f":"DATABASE!D6","v":"สาธารณสุขอำเภอหนองหงส์"}]
[null,"หัวหน้าเจ้าหน้าที่",null,null,null,null,null,null,null,"ปฏิบัติราชการแทนผู้ว่าราชการจังหวัดบุรีรัมย์"]

{"sheet":"บริสุทธิ์","index":11,"n_rows":25,"n_cols":7,"rows_kept":25,"cut":false,"hidden":false,"merged":[[24,3,24,5],[0,1,0,5],[1,1,1,5],[2,1,2,5],[3,1,3,5],[4,2,4,4],[5,2,5,4],[6,2,6,4],[7,2,7,4],[8,2,8,4],[9,1,9,5],[10,1,10,5]]}
[null,"แบบแสดงความบริสุทธิ์ใจในการจัดซื้อจัดจ้างทุกวิธีของหน่วยงาน"]
[null,"ในการเปิดเผยข้อมูลความขัดแย้งทางผลประโยชน์"]
[null,"ของหัวหน้าเจ้าหน้าที่ เจ้าหน้าที่ และผู้ตรวจรับพัสดุ"]
[null,"*********************************"]
[null,"ข้าพเจ้า",{"$f":"DATABASE!C7","v":"นางจุรีพร  บัวลอย"},null,null,"หัวหน้าเจ้าหน้าที่"]
[null,"ข้าพเจ้า",{"$f":"DATABASE!C11","v":"นางวรรณเพ็ญ  วศินไพบูลย์วงศ์"},null,null,"เจ้าหน้าที่","เลือกปริ้น"]
[null,"ข้าพเจ้า",{"$f":"DATABASE!C16","v":"นางสุรินทร์  สีระสูงเนิน"},null,null,{"$f":"IF(DATABASE!C17=\"\",DATABASE!B16,\"ประธานกรรมการ\")","v":"ผู้ตรวจรับพัสดุ"},"เลือกปริ้น"]
[null,{"$f":"IF(DATABASE!C17=\"\",\"\",\"ข้าพจ้า\")","v":""},{"$f":"IF(DATABASE!C17=\"\",\"\",DATABASE!C17)","v":""},null,null,{"$f":"IF(DATABASE!C17=\"\",\"\",\"กรรมการ\")","v":""},{"$f":"IF(DATABASE!C17=\"\",\"\",\"เลือกปริ้น\")","v":""}]
[null,{"$f":"IF(DATABASE!C18=\"\",\"\",\"ข้าพจ้า\")","v":""},{"$f":"IF(DATABASE!C18=\"\",\"\",DATABASE!C18)","v":""},null,null,{"$f":"IF(DATABASE!C18=\"\",\"\",\"กรรมการ\")","v":""},{"$f":"IF(DATABASE!C18=\"\",\"\",\"เลือกปริ้น\")","v":""}]
[null,"           ขอให้คำรับรองว่าไม่มีความเกี่ยวข้องหรือมีส่วนได้ส่วนเสียไม่ว่าโดยตรงหรือโดยอ้อม หรือผลประโยชน์ใดๆ ที่ก่อให้เกิดความขัดแย้งทางผลประโยชน์กับผู้ขาย ผู้รับจ้าง ผู้เสนองาน หรือผู้ชนะประมูล หรือผู้มีส่วนเกี่ยวข้องที่เข้ามามีนิติสัมพันธ์ และวางตัวเป็นกลางในการดำเนินการเกี่ยวกับการพัสดุ ปฏิบัติหน้าที่ด้วยจิตสำนึก ด้วยความโปร่งใส สามารถให้มีผู้เกี่ยวข้องตรวจสอบได้ทุกเวลา มุ่งประโยชน์ส่วนรวมเป็นสำคัญ ตามที่ระบุไว้ในประกาศสำนักงานปลัดกระทรวงสาธารณสุขว่าด้วยแนวทางในการปฏิบัติในหน่วยงานด้าน การจัดซื้อจัดจ้าง พ.ศ. 2559",null,null,null,null,"เลือกปริ้น"]
[null,"           หากปรากฏว่าเกิดความขัดแย้งทางผลประโยชน์ระหว่างข้าพเจ้ากับผู้ขาย ผู้รับจ้าง ผู้เสนองาน หรือ   ผู้ชนะประมูล หรือผู้มีส่วนเกี่ยวข้องที่เข้ามามีนิติสัมพันธ์ ข้าพเจ้าจะรายงานให้ทราบโดยทันที",null,null,null,null,"เลือกปริ้น"]
[null,null,null,null,null,null,"เลือกปริ้น"]
[null,null,"ลงนาม....................................................................",null,null,"ลงนาม....................................................................","เลือกปริ้น"]
[null,null,{"$f":"C5","v":"นางจุรีพร  บัวลอย"},null,null,{"$f":"C6","v":"นางวรรณเพ็ญ  วศินไพบูลย์วงศ์"},"เลือกปริ้น"]
[null,null,{"$f":"F5","v":"หัวหน้าเจ้าหน้าที่"},null,null,{"$f":"F6","v":"เจ้าหน้าที่"},"เลือกปริ้น"]
[null,null,"ลงนาม....................................................................",null,null,{"$f":"IF(DATABASE!C17=\"\",\"\",\"ลงนาม....................................................................\")","v":""},"เลือกปริ้น"]
[null,null,{"$f":"C7","v":"นางสุรินทร์  สีระสูงเนิน"},null,null,{"$f":"IF(DATABASE!C17=\"\",\"\",DATABASE!C17)","v":""},"เลือกปริ้น"]
[null,null,{"$f":"F7","v":"ผู้ตรวจรับพัสดุ"},null,null,{"$f":"F8","v":""},"เลือกปริ้น"]
[null,null,{"$f":"IF(DATABASE!C18=\"\",\"\",\"ลงนาม....................................................................\")","v":""},null,null,null,{"$f":"IF(DATABASE!C18=\"\",\"\",\"เลือกปริ้น\")","v":""}]
[null,null,{"$f":"IF(DATABASE!C18=\"\",\"\",DATABASE!C18)","v":""},null,null,null,{"$f":"IF(DATABASE!C18=\"\",\"\",\"เลือกปริ้น\")","v":""}]
[null,null,{"$f":"IF(DATABASE!C18=\"\",\"\",\"กรรมการ\")","v":""},null,null,null,{"$f":"IF(DATABASE!C18=\"\",\"\",\"เลือกปริ้น\")","v":""}]
[]
[null,null,{"$f":"เห็นชอบ!C5","v":"ซื้อวัสดุคอมพิวเตอร์ (RAM)"}]
[null,null,{"$f":"รายงานจัดซื้อ!H14","v":"โรงพยาบาลส่งเสริมสุขภาพตำบลบ้านกระเบื้องน้อย"}]
[null,null,{"$f":"ใบสั่งซื้อ!E4&\" \"&ใบสั่งซื้อ!F4&\" ลงวันที่\"","v":"ใบสั่งซื้อเลขที่ 108/2562 ลงวันที่"},{"$f":"ใบสั่งซื้อ!F5","v":"2562-03-18"}]

{"sheet":"ใบส่งของ มอบ","index":12,"n_rows":21,"n_cols":16,"rows_kept":21,"cut":false,"hidden":false,"merged":[[18,2,18,4],[19,2,19,4],[19,7,19,9],[20,5,20,10],[13,5,13,8],[7,5,7,6],[0,1,0,10],[1,1,1,10],[2,1,2,10],[3,7,3,9]]}
[null,"ใบส่งมอบพัสดุ",null,null,null,null,null,null,null,null,null,null,null,{"$f":"DAY(H4)","v":21},{"$f":"MONTH(H4)","v":3},{"$f":"YEAR(H4)","v":2562}]
[null,{"$f":"DATABASE!C19","v":"หจก. ธงชัย โอเอ เซลส์แอนเซอร์วิส"}]
[null,{"$f":"DATABASE!C20","v":"68/4-5, 70 ถ.ธานี ต.ในเมือง อ.เมือง จ.บุรีรัมย์"}]
[null,null,null,null,null,null,"วันที่","2562-03-21"]
[null,"เรื่อง    ","ส่งมอบพัสดุ และแจ้งหนี้ขอเบิกเงิน"]
[null,"เรียน   ",{"$f":"DATABASE!D14","v":"ผู้อำนวยการโรงพยาบาลส่งเสริมสุขภาพตำบลบ้านกระเบื้องน้อย"}]
[null,null,{"$f":"DATABASE!C4","v":"สำนักงานสาธารณสุขอำเภอหนองหงส์"},null,null,null,"ได้ตกลงให้ข้าพเจ้าทำการจัดส่งมอบพัสดุ"]
[null,{"$f":"ใบสั่งซื้อ!E4&\" \"&ใบสั่งซื้อ!F4&\" ลงวันที่\"","v":"ใบสั่งซื้อเลขที่ 108/2562 ลงวันที่"},null,null,null,{"$f":"ใบสั่งซื้อ!F5","v":"2562-03-18"},null,"จำนวน",{"$f":"รายงานจัดซื้อ!K6","v":1},{"$f":"รายงานจัดซื้อ!L6","v":"รายการ"}]
[null,"ในวงเงิน",{"$f":"รายงานจัดซื้อ!G15","v":6390},"บาท",{"$f":"รายงานจัดซื้อ!I15","v":"(หกพันสามร้อยเก้าสิบบาทถ้วน)"}]
[null,null,"บัดนี้ ข้าพเจ้าได้ปฏิบัติตามใบสั่งซื้อ เสร็จเรียบร้อยแล้ว จึงขอส่งมอบงานจ้าง เพื่อตรวจรับและขอเบิกจ่ายเงิน"]
[null,"จำนวน",{"$f":"C9","v":6390},"บาท",{"$f":"E9","v":"(หกพันสามร้อยเก้าสิบบาทถ้วน)"}]
[null,null,null,null,null,null,"ขอแสดงความนับถือ"]
[]
[null,null,null,null,null,{"$f":"DATABASE!D19","v":".........................................................."}]
[null,"เรียน",{"$f":"DATABASE!D14","v":"ผู้อำนวยการโรงพยาบาลส่งเสริมสุขภาพตำบลบ้านกระเบื้องน้อย"}]
[null,null," - เพื่อโปรดทราบ/เห็นควรแจ้งคณะกรรมการตรวจรับ"]
[null,null,null,null,null,null,"o","ทราบ / ดำเนินการ"]
[]
[null,null,{"$f":"DATABASE!C12","v":"นางสาวกนกรัตน์  พรมมา"}]
[null,null,{"$f":"DATABASE!D12","v":"เจ้าพนักงานสาธารณสุข"},null,null,null,null,{"$f":"DATABASE!C14","v":"นายดำรงค์  สีระสูงเนิน"}]
[null,null,null,null,null,{"$f":"DATABASE!D14","v":"ผู้อำนวยการโรงพยาบาลส่งเสริมสุขภาพตำบลบ้านกระเบื้องน้อย"}]

{"sheet":"ใบตรวจรับ","index":13,"n_rows":33,"n_cols":11,"rows_kept":33,"cut":false,"hidden":false,"merged":[[27,6,27,8],[0,1,0,9],[1,1,1,9],[2,6,2,8],[3,7,3,8],[5,1,5,9]]}
[null,"ใบตรวจรับการซื้อ"]
[null,{"$f":"DATABASE!C15","v":"โรงพยาบาลส่งเสริมสุขภาพตำบลบ้านกระเบื้องน้อย"}]
[null,null,null,null,null,"วันที่",{"$f":"'ใบส่งของ มอบ'!H4","v":"2562-03-21"}]
[null,null,{"$f":"ใบสั่งซื้อ!F4","v":"108/2562"},null,null,null,"ลงวันที่",{"$f":"'ใบส่งของ มอบ'!H4:J4","v":"2562-03-21"}]
[null,{"$f":"DATABASE!C15&\" \"&DATABASE!D15","v":"โรงพยาบาลส่งเสริมสุขภาพตำบลบ้านกระเบื้องน้อย อำเภอหนองหงส์ จังหวัดบุรีรัมย์"}]
[null,{"$f":"เห็นชอบ!C5&\" กับ \"&DATABASE!C19&\" ที่อยู่ \"&DATABASE!C20","v":"ซื้อวัสดุคอมพิวเตอร์ (RAM) กับ หจก. ธงชัย โอเอ เซลส์แอนเซอร์วิส ที่อยู่ 68/4-5, 70 ถ.ธานี ต.ในเมือง อ.เมือง จ.บุรีรัมย์"}]
[null,"จำนวน",{"$f":"รายงานจัดซื้อ!K6","v":1},{"$f":"รายงานจัดซื้อ!L6","v":"รายการ"},"เป็นเงิน",{"$f":"ใบสั่งซื้อ!G82","v":6390},"บาท",{"$f":"\"(\"&BAHTTEXT(F7)&\")\"","v":"(หกพันสามร้อยเก้าสิบบาทถ้วน)"}]
[null,null,"คณะกรรมการตรวจรับพัสดุ ได้ตรวจรับพัสดุ  ผลปรากฎว่า"]
[null,null,"ผลการตรวจรับ"]
[null,null,"o","ถูกต้อง"]
[null,null,null,"o","ครบถ้วนตามสัญญา"]
[null,null,null,"o","ไม่ครบถ้วนตามสัญญา"]
[null,null,"ค่าปรับ"]
[null,null,"o","มีค่าปรับ"]
[null,null,"o","ไม่มีค่าปรับ"]
[null,null,"(ลงชื่อ)....................................................",null,null,{"$f":"DATABASE!D16","v":"พยาบาลวิชาชีพ ชำนาญการ"},null,null,{"$f":"บริสุทธิ์!F7","v":"ผู้ตรวจรับพัสดุ"},null,"เลือกปริ้น"]
[null,null,null,{"$f":"DATABASE!C16","v":"นางสุรินทร์  สีระสูงเนิน"},null,null,null,null,null,null,"เลือกปริ้น"]
[null,null,{"$f":"IF(DATABASE!C17=\"\",\"\",\"(ลงชื่อ)....................................................\")","v":""},null,null,{"$f":"IF(DATABASE!C17=\"\",\"\",DATABASE!D17)","v":""},null,null,{"$f":"IF(DATABASE!C17=\"\",\"\",\"กรรมการ\")","v":""},null,{"$f":"IF(DATABASE!C17=\"\",\"\",\"เลือกปริ้น\")","v":""}]
[null,null,null,{"$f":"IF(DATABASE!C17=\"\",\"\",DATABASE!C17)","v":""},null,null,null,null,null,null,{"$f":"IF(DATABASE!C17=\"\",\"\",\"เลือกปริ้น\")","v":""}]
[null,null,{"$f":"IF(DATABASE!C18=\"\",\"\",\"(ลงชื่อ)....................................................\")","v":""},null,null,{"$f":"IF(DATABASE!C18=\"\",\"\",DATABASE!D18)","v":""},null,null,{"$f":"IF(DATABASE!C18=\"\",\"\",\"กรรมการ\")","v":""},null,{"$f":"IF(DATABASE!C18=\"\",\"\",\"เลือกปริ้น\")","v":""}]
[null,null,null,{"$f":"IF(DATABASE!C18=\"\",\"\",DATABASE!C18)","v":""},null,null,null,null,null,null,{"$f":"IF(DATABASE!C18=\"\",\"\",\"เลือกปริ้น\")","v":""}]
[null,"เรียน  ผู้ว่าราชการจังหวัดบุรีรัมย์ โดยสาธารณสุขอำเภอปกิบัติราชการแทน"]
[null,null," - เพื่อโปรดทราบ"]
[null,null," - คณะกรรมการตรวจรับพัสดุ ได้ทำการตรวจรับพัสดุ"]
[null,null,"และรายงานผลให้ทราบ ตามระเบียบฯ ข้อ 16(8)"]
[null,null," - จึงเรียนมาเพื่อโปรดทราบ",null,null,null,null,"ทราบ / ดำเนินการ"]
[]
[null,null,null,{"$f":"[3]DATA!C16","v":"นายชัยณรงค์  สมสะอาด"},null,null,{"$f":"[3]DATA!C4","v":"นายสนอง  อรุณศรี"}]
[null,null,null,{"$f":"[3]DATA!D16","v":"นักวิชาการสาธารณสุข ชำนาญการ"},null,null,null,{"$f":"[3]DATA!B4","v":"สาธารณสุขอำเภอหนองหงส์"}]
[null,null,null,null,null,null,null,"ปฏิบัติราชการแทนผู้ว่าราชการจังหวัดบุรีรัมย์"]
[null,null,"หมายเหตุ :",{"$f":"ใบสั่งซื้อ!B94","v":" -"}]
[null,null,null,{"$f":"ใบสั่งซื้อ!B95","v":" -"}]
[null,null,null,"เลขคุมตรวจรับ.............................................................."]

{"sheet":"เบิกจ่ายเงิน","index":14,"n_rows":33,"n_cols":13,"rows_kept":33,"cut":false,"hidden":false,"merged":[[2,8,2,9],[5,4,5,11],[24,7,24,9],[0,1,0,11],[25,7,25,9],[7,8,7,9]]}
[null,"บันทึกข้อความ"]
[null,"ส่วนราชการ",null,null,{"$f":"DATABASE!C15&\" \"&DATABASE!D15","v":"โรงพยาบาลส่งเสริมสุขภาพตำบลบ้านกระเบื้องน้อย อำเภอหนองหงส์ จังหวัดบุรีรัมย์"}]
[null,"ที่",null,{"$f":"DATABASE!C13","v":"บร 1332.1.4/"},null,".",null,"วันที่","2562-03-22"]
[null,"เรื่อง",null,{"$f":"เห็นชอบ!C5","v":"ซื้อวัสดุคอมพิวเตอร์ (RAM)"}]
[null,"เรียน",null,{"$f":"DATABASE!D14","v":"ผู้อำนวยการโรงพยาบาลส่งเสริมสุขภาพตำบลบ้านกระเบื้องน้อย"}]
[null,null,null,null,{"$f":"DATABASE!C15&\" \"&DATABASE!D15","v":"โรงพยาบาลส่งเสริมสุขภาพตำบลบ้านกระเบื้องน้อย อำเภอหนองหงส์ จังหวัดบุรีรัมย์"}]
[null,{"$f":"เห็นชอบ!C5","v":"ซื้อวัสดุคอมพิวเตอร์ (RAM)"},null,null,null,null,null,null,null,"เป็นเงินทั้งสิ้น",{"$f":"ใบสั่งซื้อ!G82","v":6390},"บาท"]
[null,{"$f":"\"(\"&BAHTTEXT(K7)&\")\"&\" ตาม\"&ใบสั่งซื้อ!E4&\" \"&ใบสั่งซื้อ!F4&\"   ลงวันที่\"","v":"(หกพันสามร้อยเก้าสิบบาทถ้วน) ตามใบสั่งซื้อเลขที่ 108/2562   ลงวันที่"},null,null,null,null,null,null,{"$f":"ใบสั่งซื้อ!F5","v":"2562-03-18"}]
[null,{"$f":"DATABASE!C19&\" \"&DATABASE!C20&\" แล้วนั้น\"","v":"หจก. ธงชัย โอเอ เซลส์แอนเซอร์วิส 68/4-5, 70 ถ.ธานี ต.ในเมือง อ.เมือง จ.บุรีรัมย์ แล้วนั้น"}]
[null,null,null,null,"คณะกรรมการตรวจรับ ได้ตรวจรับถูกต้องแล้ว ดังเอกสารแนบการเบิกจ่าย ดังนี้",null,null,null,null,null,null,null,"ลงเลขเอกสาร"]
[null,null,null,null,"1. ขออนุมัติส่งซื้อ",null,null,null,null,{"$f":"IF(E11=\"\",\"\",\"จำนวน\")","v":"จำนวน"},{"$f":"IF(M11=\"\",\" -  ฉบับ\",M11&\"  ฉบับ\")","v":"1  ฉบับ"},null,1]
[null,null,null,null,"2. ใบเสนอราคา",null,null,null,null,{"$f":"IF(E12=\"\",\"\",\"จำนวน\")","v":"จำนวน"},"1  ฉบับ",null,1]
[null,null,null,null,"3. รายงานขอจ้าง",null,null,null,null,{"$f":"IF(E13=\"\",\"\",\"จำนวน\")","v":"จำนวน"},"1  ฉบับ",null,1]
[null,null,null,null,"4. คำสั่งจังหวัดบุรีรัมย์ เรื่อง แต่งตั้งคณะกรรมการตรวจรับพัสดุ",null,null,null,null,{"$f":"IF(E14=\"\",\"\",\"จำนวน\")","v":"จำนวน"},"0  ฉบับ",null,0]
[null,null,null,null,"5. รายงานผลการพิจารณาและขออนุมัติสั่งซื้อ",null,null,null,null,{"$f":"IF(E15=\"\",\"\",\"จำนวน\")","v":"จำนวน"},"0  ฉบับ",null,0]
[null,null,null,null,"6. ประกาศจังหวัดบุรีรัมย์",null,null,null,null,"จำนวน","0  ฉบับ",null,0]
[null,null,null,null,"4. ใบสั่งซื้อ",null,null,null,null,"จำนวน","1  ฉบับ",null,1]
[null,null,null,null,"5. ใบส่งของ",null,null,null,null,"จำนวน","1  ฉบับ",null,1]
[null,null,null,null,"6. ใบตรวจรับการซื้อ",null,null,null,null,"จำนวน","1  ฉบับ",null,1]
[null,null,null,null,"7. แบบแสดงความบริสุทธ์ใจในการซื้อ",null,null,null,null,"จำนวน","1  ฉบับ",null,1]
[null,null,null,null,"8. รายงานผลการพิจารณาตามข้อ 16",null,null,null,null,{"$f":"IF(E21=\"\",\"\",\"จำนวน\")","v":"จำนวน"},{"$f":"IF(M21=\"\",\" -  ฉบับ\",M21&\"  ฉบับ\")","v":"1  ฉบับ"},null,1]
[null,null,null,null,"11. เอกสารข้อมูลสาระสำคัญในสัญญา e-GP",null,null,null,null,"จำนวน","0  ฉบับ",null,0]
[null,null,null,null,"จึงเรียนมาเพื่อนโปรดดำเนินการเบิกจ่ายเงินให้ต่อไป",null,null,null,null,null,null,null,1]
[null,null,null,null,null,null,null,null,null,null,null,null,1]
[null,null,null,null,null,null,null,{"$f":"DATABASE!C12","v":"นางสาวกนกรัตน์  พรมมา"},null,null,null,null,1]
[null,null,null,null,null,null,null,{"$f":"DATABASE!D12","v":"เจ้าพนักงานสาธารณสุข"},null,null,null,null,1]
[null,{"$f":"B5&\"  \"&D5","v":"เรียน  ผู้อำนวยการโรงพยาบาลส่งเสริมสุขภาพตำบลบ้านกระเบื้องน้อย"},null,null,null,null,null,null,null,null,null,null,1]
[null,null,null," - เห็นควรอนุมัติ",null,null,null,"คำสั่ง ",{"$f":"D5","v":"ผู้อำนวยการโรงพยาบาลส่งเสริมสุขภาพตำบลบ้านกระเบื้องน้อย"},null,null,null,1]
[null,null,null,null,null,null,null,"¨","อนุมัติ","¨  ไม่อนุมัติ เนื่องจาก.........................",null,null,1]
[null,null,null,null,{"$f":"DATABASE!C12","v":"นางสาวกนกรัตน์  พรมมา"},null,null,null,null,null,null,null,1]
[null,null,null,null,{"$f":"DATABASE!D12","v":"เจ้าพนักงานสาธารณสุข"},null,null,null,{"$f":"DATABASE!C14","v":"นายดำรงค์  สีระสูงเนิน"},null,null,null,1]
[null,null,null,null,null,null,null,null,{"$f":"DATABASE!D14","v":"ผู้อำนวยการโรงพยาบาลส่งเสริมสุขภาพตำบลบ้านกระเบื้องน้อย"},null,null,null,1]
[null,null,null,null,null,null,null,null,{"$f":"DATABASE!C8","v":"ปฏิบัติตามคำสั่ง สป. ที่ 1895/2561 ลว. 5 มิถุนายน 2561"},null,null,null,1]